"molecule_id","MPC05","MPC06","MPC07","N.","Eig01_AEA.ri.","GATS1s","SpMax_AEA.ri.","MPC04","X5","LOC","piPC06","Eig01_EA.ri.","SpDiam_AEA.ed.","SpDiam_EA.ri.","SpMax_EA.ri.","X4A","BAC","CATS2D_03_AL","ZM2Kup","TPC","Wap","Eig02_AEA.dm.","Eig03_AEA.dm.","Eig03_AEA.ed.","Eig03_EA.ed.","GGI4","GGI5","MWC06","MWC07","MWC08","MWC09","MWC10","SM02_EA.dm.","SM02_EA.ed.","SM04_EA.dm.","SM12_AEA.dm.","SpAD_EA.dm.","SRW10","TWC","SM06_EA.ed.","SM07_EA.ed.","SM08_EA.ed.","SM09_EA.ed.","SM10_EA.ed.","SM11_EA.ed.","SM12_EA.ed.","SM13_AEA.ed.","SM13_EA.ed.","SM14_EA.ed.","SM15_AEA.ed.","SM15_EA.ed.","SpMAD_AEA.ed.","X5A","Eig01_EA.dm.","SM06_EA.dm.","SM08_EA.dm.","SM10_EA.dm.","SM12_EA.dm.","SM14_EA.dm.","SpDiam_EA.dm.","SpMax_EA.dm.","piPC07","pXC50"
{1 4.844,2 5.075,3 5.283,4 3.8,5 4.302,6 0.595,7 4.302,8 4.533,9 8.116,10 1.137,11 6.405,12 3.138,13 6.888,14 5.138,15 3.138,16 0.102,17 34,18 6,19 424.897,20 7.909,21 27252,22 3.707,23 3.507,24 6.271,25 9.327,26 2.149,27 1.73,28 8.672,29 9.592,30 10.524,31 11.452,32 12.387,33 3.559,34 6.806,35 5.632,36 9.327,37 15.286,38 10.36,39 12.887,40 15.623,41 17.867,42 20.42,43 22.806,44 25.312,45 27.759,46 30.253,47 25.938,48 32.728,49 35.223,50 29.772,51 37.712,52 1.585,53 0.064,54 3.272,55 7.904,56 10.23,57 12.577,58 14.935,59 17.299,60 6.545,61 3.272,62 6.851,63 7.921}
{0 CHEMBL10347,1 4.905,2 5.094,3 5.357,4 3.8,5 4.317,6 0.691,7 4.317,8 4.585,9 8.483,10 0.902,11 6.249,12 3.265,13 6.64,14 5.265,15 3.265,16 0.1,17 12,18 5,19 347.173,20 8.458,21 55192,22 3.537,23 3.057,24 6.289,25 9.429,26 1.991,27 0.924,28 8.718,29 9.652,30 10.59,31 11.527,32 12.466,33 2.529,34 6.853,35 3.862,36 9.429,37 7.635,38 10.513,39 12.962,40 15.68,41 17.904,42 20.434,43 22.791,44 25.266,45 27.677,46 30.134,47 26.009,48 32.567,49 35.019,50 29.826,51 37.463,52 1.611,53 0.063,54 2.443,55 5.489,56 7.209,57 8.963,58 10.734,59 12.512,60 4.174,61 2.443,62 6.686,63 7.398}
{0 CHEMBL104082,1 4.913,2 5.056,3 5.081,4 2.8,5 4.402,6 0.754,7 4.402,8 4.682,9 9.06,10 1.258,11 6.487,12 3.384,13 7.037,14 5.384,15 3.384,16 0.112,17 62,18 9,19 572.416,20 8.245,21 48932,22 3.514,23 3.184,24 6.298,25 9.203,26 2.404,27 2.506,28 8.84,29 9.741,30 10.656,31 11.563,32 12.482,33 2.697,34 6.995,35 3.31,36 9.203,37 11.372,38 10.573,39 12.994,40 15.823,41 18.107,42 20.683,43 23.119,44 25.662,45 28.162,46 30.701,47 26.167,48 33.228,49 35.771,50 30.027,51 38.311,52 1.578,53 0.067,54 1.674,55 4.106,56 5.002,57 5.957,58 6.944,59 7.949,60 3.349,61 1.674,62 6.81,63 8.061}
{0 CHEMBL104455,1 4.92,2 5.063,3 5.094,4 2.9,5 4.402,6 0.749,7 4.402,8 4.691,9 8.958,10 1.298,11 6.592,12 3.384,13 7.004,14 5.384,15 3.384,16 0.109,17 62,18 9,19 555.416,20 8.215,21 46153,22 3.514,23 3.193,24 6.432,25 9.787,26 2.506,27 2.291,28 8.84,29 9.749,30 10.672,31 11.585,32 12.511,33 2.697,34 6.997,35 3.31,36 9.787,37 11.372,38 10.593,39 13.018,40 15.896,41 18.182,42 20.754,43 23.185,44 25.72,45 28.212,46 30.744,47 26.245,48 33.265,49 35.801,50 30.105,51 38.336,52 1.598,53 0.066,54 1.674,55 4.106,56 5.002,57 5.957,58 6.944,59 7.949,60 3.349,61 1.674,62 6.915,63 8.666}
{0 CHEMBL105893,1 4.934,2 5.069,3 5.106,4 2.8,5 4.402,6 0.753,7 4.402,8 4.71,9 9.231,10 1.258,11 6.486,12 3.384,13 7.037,14 5.384,15 3.384,16 0.111,17 62,18 9,19 573.416,20 8.245,21 48932,22 3.514,23 3.192,24 6.432,25 9.787,26 2.404,27 2.367,28 8.858,29 9.763,30 10.682,31 11.592,32 12.515,33 2.697,34 7.011,35 3.31,36 9.787,37 11.372,38 10.594,39 13.024,40 15.895,41 18.181,42 20.753,43 23.183,44 25.719,45 28.211,46 30.743,47 26.244,48 33.264,49 35.801,50 30.103,51 38.335,52 1.582,53 0.067,54 1.674,55 4.106,56 5.002,57 5.957,58 6.944,59 7.949,60 3.349,61 1.674,62 6.816,63 7.342}
{0 CHEMBL107213,1 4.942,2 5.13,3 5.242,4 2.9,5 4.422,6 0.747,7 4.422,8 4.682,9 8.987,10 1.249,11 6.54,12 3.403,13 7.065,14 5.403,15 3.403,16 0.11,17 49,18 11,19 562.416,20 7.977,21 29595,22 3.516,23 3.208,24 6.298,25 9.203,26 2.463,27 2.347,28 8.825,29 9.736,30 10.663,31 11.583,32 12.515,33 2.697,34 6.959,35 3.31,36 9.203,37 11.372,38 10.545,39 13.018,40 15.874,41 18.181,42 20.773,43 23.226,44 25.781,45 28.292,46 30.841,47 26.212,48 33.377,49 35.928,50 30.089,51 38.476,52 1.563,53 0.065,54 1.674,55 4.106,56 5.002,57 5.957,58 6.944,59 7.949,60 3.349,61 1.674,62 6.924,63 7.257}
{0 CHEMBL107949,1 4.754,2 4.89,3 4.997,4 2.5,5 4.49,6 0.807,7 4.49,8 4.595,9 8.112,10 0.854,11 6.104,12 3.471,13 6.969,14 5.471,15 3.471,16 0.114,17 86,18 7,19 512.674,20 8.141,21 48740,22 3.726,23 3.502,24 6.671,25 10.714,26 2.223,27 2.111,28 8.855,29 9.736,30 10.645,31 11.533,32 12.444,33 3.759,34 7.127,35 6.016,36 10.714,37 20.253,38 10.62,39 12.963,40 16.137,41 18.465,42 21.015,43 23.451,44 25.972,45 28.454,46 30.971,47 26.712,48 33.475,49 35.994,50 30.63,51 38.51,52 1.57,53 0.071,54 3.784,55 8.588,56 11.208,57 13.837,58 16.469,59 19.103,60 7.434,61 3.784,62 6.347,63 7.208}
{0 CHEMBL117345,1 4.344,2 4.304,3 4.431,4 6.1,5 4.012,6 0.949,7 4.012,8 4.159,9 6.076,11 5.412,12 3.002,13 6.301,14 5.002,15 3.002,16 0.119,18 2,19 276.127,20 7.021,21 9654,22 3.28,23 2.466,24 5.247,25 6.4,26 0.604,27 0.354,28 8.273,29 9.137,30 10.007,31 10.874,32 11.745,33 1.618,34 6.389,35 1.617,36 6.4,37 4.933,38 9.978,39 12.288,40 14.613,41 16.678,42 19.084,43 21.289,44 23.629,45 25.89,46 28.206,47 24.869,48 30.491,49 32.799,50 28.557,51 35.094,52 1.49,53 0.08,54 1.263,55 1.818,56 2.125,57 2.494,58 2.9,59 3.33,60 2.232,61 1.263,62 5.762,63 6}
{0 CHEMBL117984,1 4.078,2 4.043,3 4.174,4 5.9,5 4.006,6 0.938,7 4.006,8 3.912,9 5.152,11 5.263,12 3.005,13 6.377,14 5.005,15 3.005,16 0.132,18 1,19 253.493,20 6.615,21 5932,22 3.029,23 2.361,24 5.247,25 6.4,26 0.342,27 0.174,28 8.029,29 8.857,30 9.69,31 10.523,32 11.36,33 1.618,34 6.129,35 1.617,36 6.4,37 4.933,38 9.698,39 11.929,40 14.195,41 16.263,42 18.676,43 20.894,44 23.248,45 25.526,46 27.859,47 24.464,48 30.161,49 32.486,50 28.162,51 34.798,52 1.421,53 0.089,54 1.263,55 1.818,56 2.125,57 2.494,58 2.9,59 3.33,60 2.232,61 1.263,62 5.624,63 6}
{0 CHEMBL118151,1 4.094,2 4.007,3 4.127,4 6.7,5 4.009,6 0.945,7 4.009,8 3.912,9 4.941,10 0.405,11 5.269,12 3.002,13 6.301,14 5.002,15 3.002,16 0.127,17 2,19 253.268,20 6.46,21 4481,22 3.248,23 2.361,24 5.247,25 6.4,26 0.484,27 0.396,28 8.058,29 8.904,30 9.754,31 10.603,32 11.455,33 1.738,34 6.196,35 1.755,36 6.4,37 5.725,38 9.8,39 12.012,40 14.39,41 16.449,42 18.851,43 21.051,44 23.391,45 25.651,46 27.97,47 24.696,48 30.258,49 32.571,50 28.383,51 34.873,52 1.483,53 0.084,54 1.325,55 2.032,56 2.443,57 2.922,58 3.438,59 3.975,60 2.304,61 1.325,62 5.642,63 6}
{0 CHEMBL118642,1 4.043,2 3.892,3 4.007,4 6.7,5 4.006,6 0.948,7 4.006,8 3.871,9 4.902,11 5.188,12 3.005,13 6.3,14 5.005,15 3.005,16 0.13,19 245.493,20 6.42,21 4402,22 3.041,23 2.361,24 5.247,25 6.4,26 0.373,27 0.174,28 7.987,29 8.82,30 9.658,31 10.495,32 11.336,33 1.618,34 6.094,35 1.617,36 6.4,37 4.933,38 9.702,39 11.902,40 14.195,41 16.263,42 18.676,43 20.895,44 23.248,45 25.526,46 27.859,47 24.465,48 30.161,49 32.486,50 28.163,51 34.799,52 1.445,53 0.088,54 1.263,55 1.818,56 2.125,57 2.494,58 2.9,59 3.33,60 2.232,61 1.263,62 5.557,63 6}
{0 CHEMBL119046,1 4.043,2 3.932,3 4.043,4 7.1,5 4.007,6 0.956,7 4.007,8 3.85,9 4.773,11 5.237,12 3.001,13 6.301,14 5.001,15 3.001,16 0.128,19 241.493,20 6.358,21 3932,22 3.026,23 2.361,24 5.247,25 6.4,26 0.373,27 0.396,28 7.968,29 8.807,30 9.651,31 10.494,32 11.341,33 1.618,34 6.075,35 1.617,36 6.4,37 4.933,38 9.687,39 11.902,40 14.196,41 16.264,42 18.679,43 20.897,44 23.252,45 25.53,46 27.863,47 24.466,48 30.166,49 32.491,50 28.164,51 34.804,52 1.458,53 0.085,54 1.263,55 1.818,56 2.125,57 2.494,58 2.9,59 3.33,60 2.232,61 1.263,62 5.613,63 6}
{0 CHEMBL119289,1 3.989,2 3.892,3 4.025,4 6.7,5 4.007,6 0.945,7 4.007,8 3.912,9 4.553,10 0.405,11 5.188,12 3.006,13 6.3,14 5.006,15 3.006,16 0.128,17 2,19 253.268,20 6.418,21 4313,22 3.294,23 2.361,24 5.247,25 6.4,26 0.427,27 0.163,28 8.055,29 8.899,30 9.746,31 10.592,32 11.44,33 1.738,34 6.196,35 1.755,36 6.4,37 5.725,38 9.747,39 11.999,40 14.391,41 16.458,42 18.854,43 21.057,44 23.393,45 25.654,46 27.971,47 24.702,48 30.259,49 32.57,50 28.389,51 34.871,52 1.483,53 0.086,54 1.325,55 2.032,56 2.443,57 2.922,58 3.438,59 3.975,60 2.304,61 1.325,62 5.561,63 6}
{0 CHEMBL119290,1 4.06,2 4.06,3 4.078,4 6.7,5 4.007,6 0.948,7 4.007,8 3.871,9 4.898,11 5.304,12 3.001,13 6.301,14 5.001,15 3.001,16 0.129,18 1,19 245.493,20 6.461,21 4597,22 3.018,23 2.361,24 5.247,25 6.4,26 0.347,27 0.386,28 7.99,29 8.826,30 9.667,31 10.508,32 11.353,33 1.618,34 6.094,35 1.617,36 6.4,37 4.933,38 9.656,39 11.916,40 14.196,41 16.264,42 18.678,43 20.897,44 23.252,45 25.53,46 27.863,47 24.465,48 30.166,49 32.491,50 28.164,51 34.804,52 1.446,53 0.086,54 1.263,55 1.818,56 2.125,57 2.494,58 2.9,59 3.33,60 2.232,61 1.263,62 5.624,63 6}
{0 CHEMBL119336,1 4.06,2 4.111,3 4.205,4 3.3,5 4.031,6 0.921,7 4.031,8 3.951,9 4.963,11 4.899,12 3.008,13 6.456,14 5.008,15 3.008,16 0.13,18 2,19 211.085,20 7.058,21 12423,22 3.019,23 2.277,24 5.075,25 5.975,26 0.476,27 0.417,28 8.064,29 8.897,30 9.739,31 10.581,32 11.43,33 1.51,34 6.151,35 1.826,36 5.975,37 3.354,38 9.664,39 11.991,40 14.24,41 16.312,42 18.736,43 20.959,44 23.322,45 25.605,46 27.945,47 24.5,48 30.253,49 32.585,50 28.205,51 34.903,52 1.413,53 0.087,54 1.408,55 2.304,56 2.873,57 3.495,58 4.147,59 4.814,60 2.428,61 1.408,62 5.139,63 7.342}
{0 CHEMBL119434,1 4.06,2 4.025,3 4.043,4 6.3,5 4.006,6 0.942,7 4.006,8 3.892,9 5.027,11 5.258,12 3.005,13 6.302,14 5.005,15 3.005,16 0.131,18 1,19 249.493,20 6.521,21 5131,22 3.033,23 2.361,24 5.247,25 6.4,26 0.347,27 0.163,28 8.008,29 8.838,30 9.674,31 10.509,32 11.348,33 1.618,34 6.111,35 1.617,36 6.4,37 4.933,38 9.672,39 11.915,40 14.194,41 16.263,42 18.676,43 20.894,44 23.248,45 25.526,46 27.859,47 24.464,48 30.161,49 32.486,50 28.162,51 34.798,52 1.436,53 0.088,54 1.263,55 1.818,56 2.125,57 2.494,58 2.9,59 3.33,60 2.232,61 1.263,62 5.568,63 6}
{0 CHEMBL119639,1 4.344,2 4.277,3 4.382,4 5.8,5 4.007,6 0.945,7 4.007,8 4.174,9 6.198,11 5.371,12 3.006,13 6.3,14 5.006,15 3.006,16 0.121,18 2,19 280.127,20 7.069,21 10692,22 3.3,23 2.479,24 5.247,25 6.4,26 0.604,27 0.243,28 8.286,29 9.146,30 10.011,31 10.872,32 11.738,33 1.618,34 6.402,35 1.617,36 6.4,37 4.933,38 9.99,39 12.285,40 14.612,41 16.677,42 19.083,43 21.288,44 23.627,45 25.888,46 28.203,47 24.868,48 30.488,49 32.795,50 28.556,51 35.09,52 1.481,53 0.082,54 1.263,55 1.818,56 2.125,57 2.494,58 2.9,59 3.33,60 2.232,61 1.263,62 5.704,63 6}
{0 CHEMBL120011,1 4.382,2 4.382,3 4.454,4 5.8,5 4.006,6 0.951,7 4.006,8 4.174,9 6.584,11 5.748,12 3.005,13 6.3,14 5.005,15 3.005,16 0.125,18 2,19 320.493,20 7.243,21 13854,22 3.21,23 2.848,24 5.309,25 6.871,26 0.739,27 0.319,28 8.301,29 9.149,30 10,31 10.85,32 11.702,33 1.814,34 6.422,35 1.775,36 6.871,37 6.382,38 10.001,39 12.258,40 14.55,41 16.597,42 18.989,43 21.182,44 23.513,45 25.767,46 28.078,47 24.819,48 30.359,49 32.665,50 28.496,51 34.96,52 1.463,53 0.083,54 1.29,55 1.986,56 2.322,57 2.725,58 3.168,59 3.634,60 2.327,61 1.29,62 6.05,63 6}
{0 CHEMBL122220,1 4.625,2 4.779,3 4.812,4 3.4,5 4.422,6 0.654,7 4.422,8 4.382,9 6.515,10 1.751,11 6.083,12 3.368,13 7.032,14 5.368,15 3.368,16 0.107,17 138,18 4,19 497.892,20 7.134,21 10032,22 3.895,23 3.508,24 6.394,25 9.952,26 2.676,27 2.437,28 8.654,29 9.547,30 10.48,31 11.382,32 12.316,33 3.6,34 6.948,35 5.539,36 9.952,37 21.422,38 10.456,39 12.821,40 16.117,41 18.468,42 21.037,43 23.494,44 26.034,45 28.537,46 31.073,47 26.593,48 33.598,49 36.137,50 30.502,51 38.674,52 1.623,53 0.065,54 3.825,55 8.077,56 10.738,57 13.417,58 16.1,59 18.783,60 5.5,61 3.825,62 6.357,63 5.479}
{0 CHEMBL122332,1 4.736,2 4.86,3 4.898,4 1.1,5 4.422,6 0.613,7 4.422,8 4.522,9 8.18,10 3.218,11 6.113,12 3.368,13 7.348,14 5.368,15 3.368,16 0.118,17 112,18 5,19 538.484,20 7.683,21 26753,22 3.892,23 3.48,24 6.296,25 9.188,26 2.596,27 2.271,28 8.733,29 9.612,30 10.518,31 11.413,32 12.329,33 3.546,34 6.93,35 5.531,36 9.188,37 19.022,38 10.474,39 12.846,40 16.015,41 18.373,42 20.963,43 23.432,44 25.986,45 28.498,46 31.043,47 26.505,48 33.574,49 36.118,50 30.431,51 38.659,52 1.497,53 0.072,54 3.825,55 8.076,56 10.737,57 13.417,58 16.1,59 18.783,60 5.5,61 3.825,62 6.393,63 7.062}
{0 CHEMBL122671,1 5.075,2 5.159,3 5.236,4 6.2,5 4.612,6 0.55,7 4.612,8 4.828,9 11.106,10 0.749,11 6.691,12 3.61,13 7.765,14 5.61,15 3.61,16 0.112,17 54,18 10,19 634.102,20 8.46,21 66252,22 3.779,23 3.694,24 6.268,25 9.057,26 2.849,27 2.201,28 9.018,29 9.92,30 10.833,31 11.739,32 12.654,33 2.904,34 7.22,35 4.234,36 9.057,37 12.261,38 10.817,39 13.168,40 16.697,41 19.255,42 21.957,43 24.61,44 27.304,45 29.99,46 32.688,47 27.264,48 35.387,49 38.09,50 31.343,51 40.795,52 1.577,53 0.07,54 2.612,55 5.961,56 7.796,57 9.67,58 11.563,59 13.468,60 4.612,61 2.612,62 7.037,63 8}
{0 CHEMBL122740,1 4.718,2 4.844,3 4.883,4 2.2,5 4.422,6 0.627,7 4.422,8 4.5,9 7.841,10 2.827,11 6.097,12 3.368,13 7.305,14 5.368,15 3.368,16 0.115,17 148,18 5,19 537.892,20 7.605,21 22997,22 3.894,23 3.485,24 6.394,25 9.951,26 2.756,27 2.382,28 8.76,29 9.634,30 10.548,31 11.437,32 12.357,33 3.6,34 7.022,35 5.539,36 9.951,37 21.422,38 10.526,39 12.872,40 16.118,41 18.468,42 21.037,43 23.494,44 26.034,45 28.537,46 31.073,47 26.593,48 33.598,49 36.137,50 30.503,51 38.674,52 1.528,53 0.071,54 3.825,55 8.077,56 10.738,57 13.417,58 16.1,59 18.783,60 5.5,61 3.825,62 6.371,63 7.759}
{0 CHEMBL123102,1 5.112,2 5.193,3 5.298,4 4.8,5 4.612,6 0.506,7 4.612,8 4.852,9 11.553,10 0.861,11 6.71,12 3.61,13 7.765,14 5.61,15 3.61,16 0.11,17 55,18 11,19 655.803,20 8.497,21 68781,22 3.784,23 3.747,24 6.296,25 9.188,26 2.849,27 2.118,28 9.038,29 9.943,30 10.857,31 11.766,32 12.682,33 3.088,34 7.235,35 4.417,36 9.188,37 13.65,38 10.832,39 13.195,40 16.709,41 19.263,42 21.965,43 24.617,44 27.31,45 29.995,46 32.693,47 27.271,48 35.391,49 38.094,50 31.348,51 40.798,52 1.581,53 0.07,54 2.612,55 6.064,56 7.845,57 9.692,58 11.572,59 13.471,60 4.612,61 2.612,62 7.077,63 7.523}
{0 CHEMBL123211,1 4.682,2 4.812,3 4.852,4 1.3,5 4.422,6 0.621,7 4.422,8 4.454,9 7.43,10 2.707,11 6.099,12 3.368,13 7.341,14 5.368,15 3.368,16 0.114,17 106,18 5,19 514.484,20 7.435,21 17124,22 3.892,23 3.48,24 6.296,25 9.188,26 2.596,27 2.271,28 8.669,29 9.559,30 10.476,31 11.378,32 12.302,33 3.546,34 6.882,35 5.531,36 9.188,37 19.022,38 10.43,39 12.813,40 16.014,41 18.373,42 20.963,43 23.432,44 25.986,45 28.498,46 31.043,47 26.505,48 33.574,49 36.118,50 30.431,51 38.659,52 1.534,53 0.069,54 3.825,55 8.076,56 10.737,57 13.417,58 16.1,59 18.783,60 5.5,61 3.825,62 6.383,63 7.777}
{0 CHEMBL123325,1 4.913,2 5.124,3 5.366,4 4,5 4.317,6 0.576,7 4.317,8 4.575,9 8.43,10 0.902,11 6.315,12 3.259,13 6.634,14 5.259,15 3.259,16 0.099,17 12,18 5,19 377.355,20 8.458,21 55152,22 3.536,23 3.185,24 6.255,25 9.295,26 2.031,27 1.125,28 8.717,29 9.651,30 10.59,31 11.527,32 12.467,33 2.261,34 6.851,35 2.932,36 9.295,37 7.246,38 10.51,39 12.963,40 15.648,41 17.857,42 20.383,43 22.728,44 25.198,45 27.601,46 30.053,47 25.974,48 32.481,49 34.93,50 29.78,51 37.369,52 1.613,53 0.062,54 1.674,55 3.841,56 4.834,57 5.853,58 6.88,59 7.91,60 3.349,61 1.674,62 6.738,63 6.539}
{0 CHEMBL123769,1 5.1,2 5.187,3 5.278,4 3.7,5 4.612,6 0.51,7 4.612,8 4.844,9 11.389,10 0.861,11 6.708,12 3.61,13 7.765,14 5.61,15 3.61,16 0.111,17 55,18 12,19 671.567,20 8.497,21 68781,22 3.785,23 3.773,24 6.296,25 9.188,26 2.929,27 2.229,28 9.034,29 9.938,30 10.85,31 11.759,32 12.674,33 3.231,34 7.233,35 4.565,36 9.188,37 14.882,38 10.83,39 13.187,40 16.705,41 19.261,42 21.963,43 24.615,44 27.309,45 29.994,46 32.692,47 27.269,48 35.39,49 38.093,50 31.347,51 40.797,52 1.582,53 0.07,54 2.612,55 6.156,56 7.891,57 9.713,58 11.582,59 13.475,60 4.612,61 2.612,62 7.063,63 6.87}
{0 CHEMBL124442,1 4.663,2 4.796,3 4.836,4 1.4,5 4.422,6 0.626,7 4.422,8 4.431,9 7.18,10 2.509,11 6.095,12 3.368,13 7.335,14 5.368,15 3.368,16 0.112,17 104,18 5,19 506.484,20 7.342,21 14533,22 3.892,23 3.48,24 6.296,25 9.188,26 2.596,27 2.271,28 8.647,29 9.541,30 10.461,31 11.367,32 12.292,33 3.546,34 6.866,35 5.531,36 9.188,37 19.022,38 10.415,39 12.802,40 16.013,41 18.373,42 20.963,43 23.432,44 25.986,45 28.498,46 31.043,47 26.505,48 33.574,49 36.118,50 30.431,51 38.659,52 1.55,53 0.068,54 3.825,55 8.076,56 10.737,57 13.417,58 16.1,59 18.783,60 5.5,61 3.825,62 6.38,63 7.866}
{0 CHEMBL124727,1 4.605,2 4.745,3 4.779,4 1.9,5 4.422,6 0.649,7 4.422,8 4.357,9 6.42,10 1.799,11 6.081,12 3.368,13 7.265,14 5.368,15 3.368,16 0.107,17 98,18 5,19 482.484,20 7.017,21 8504,22 3.892,23 3.48,24 6.296,25 9.188,26 2.596,27 2.271,28 8.577,29 9.484,30 10.416,31 11.33,32 12.263,33 3.546,34 6.815,35 5.531,36 9.188,37 19.022,38 10.369,39 12.767,40 16.013,41 18.373,42 20.963,43 23.432,44 25.986,45 28.498,46 31.043,47 26.505,48 33.574,49 36.118,50 30.431,51 38.659,52 1.618,53 0.065,54 3.825,55 8.076,56 10.737,57 13.417,58 16.1,59 18.783,60 5.5,61 3.825,62 6.366,63 8.668}
{0 CHEMBL125294,1 5.1,2 5.187,3 5.278,4 6,5 4.612,6 0.506,7 4.612,8 4.844,9 11.389,10 0.861,11 6.708,12 3.61,13 7.765,14 5.61,15 3.61,16 0.111,17 55,18 10,19 642.666,20 8.497,21 68781,22 3.779,23 3.707,24 6.296,25 9.188,26 2.929,27 2.229,28 9.034,29 9.938,30 10.85,31 11.759,32 12.674,33 2.921,34 7.233,35 4.243,36 9.188,37 12.418,38 10.83,39 13.187,40 16.705,41 19.261,42 21.963,43 24.615,44 27.309,45 29.994,46 32.692,47 27.269,48 35.39,49 38.093,50 31.347,51 40.797,52 1.582,53 0.07,54 2.612,55 5.964,56 7.797,57 9.67,58 11.563,59 13.468,60 4.612,61 2.612,62 7.063,63 5.301}
{0 CHEMBL125651,1 4.7,2 4.828,3 4.868,4 2.4,5 4.422,6 0.63,7 4.422,8 4.477,9 7.591,10 2.646,11 6.092,12 3.368,13 7.288,14 5.368,15 3.368,16 0.114,17 146,18 5,19 529.892,20 7.523,21 19796,22 3.894,23 3.485,24 6.394,25 9.951,26 2.756,27 2.382,28 8.739,29 9.617,30 10.534,31 11.426,32 12.348,33 3.6,34 7.008,35 5.539,36 9.951,37 21.422,38 10.512,39 12.862,40 16.118,41 18.468,42 21.037,43 23.494,44 26.034,45 28.537,46 31.073,47 26.593,48 33.598,49 36.137,50 30.503,51 38.674,52 1.544,53 0.07,54 3.825,55 8.077,56 10.738,57 13.417,58 16.1,59 18.783,60 5.5,61 3.825,62 6.368,63 5.932}
{0 CHEMBL125814,1 4.754,2 4.875,3 4.913,4 2,5 4.422,6 0.622,7 4.422,8 4.543,9 8.341,10 3.154,11 6.106,12 3.368,13 7.325,14 5.368,15 3.368,16 0.118,17 152,18 5,19 553.892,20 7.757,21 30367,22 3.894,23 3.485,24 6.394,25 9.951,26 2.756,27 2.382,28 8.799,29 9.667,30 10.574,31 11.459,32 12.374,33 3.6,34 7.05,35 5.539,36 9.951,37 21.422,38 10.553,39 12.893,40 16.119,41 18.468,42 21.037,43 23.494,44 26.034,45 28.537,46 31.073,47 26.593,48 33.598,49 36.137,50 30.503,51 38.674,52 1.503,53 0.073,54 3.825,55 8.077,56 10.738,57 13.417,58 16.1,59 18.783,60 5.5,61 3.825,62 6.378,63 7.197}
{0 CHEMBL125824,1 4.644,2 4.779,3 4.82,4 1.5,5 4.422,6 0.632,7 4.422,8 4.407,9 6.93,10 2.294,11 6.09,12 3.368,13 7.326,14 5.368,15 3.368,16 0.111,17 102,18 5,19 498.484,20 7.242,21 12238,22 3.892,23 3.48,24 6.296,25 9.188,26 2.596,27 2.271,28 8.624,29 9.522,30 10.446,31 11.355,32 12.283,33 3.546,34 6.849,35 5.531,36 9.188,37 19.022,38 10.4,39 12.79,40 16.013,41 18.373,42 20.963,43 23.432,44 25.986,45 28.498,46 31.043,47 26.505,48 33.574,49 36.118,50 30.431,51 38.659,52 1.569,53 0.067,54 3.825,55 8.076,56 10.737,57 13.417,58 16.1,59 18.783,60 5.5,61 3.825,62 6.376,63 8.62}
{0 CHEMBL136357,1 4.382,2 4.554,3 4.673,4 3.2,5 4.49,6 0.817,7 4.49,8 4.205,9 5.235,10 1.587,11 5.723,12 3.471,13 6.926,14 5.471,15 3.471,16 0.11,17 113,18 3,19 305.958,20 6.902,21 7438,22 3.726,23 3.502,24 6.671,25 10.714,26 1.895,27 1.886,28 8.523,29 9.411,30 10.337,31 11.234,32 12.162,33 3.61,34 6.849,35 5.994,36 10.714,37 14.687,38 10.313,39 12.671,40 16.048,41 18.405,42 20.966,43 23.416,44 25.946,45 28.435,46 30.956,47 26.652,48 33.464,49 35.986,50 30.586,51 38.504,52 1.63,53 0.066,54 3.784,55 8.585,56 11.207,57 13.837,58 16.469,59 19.103,60 7.434,61 3.784,62 6.02,63 5.824}
{0 CHEMBL136432,1 4.804,2 4.99,3 5.204,4 3.5,5 4.296,6 0.897,7 4.296,8 4.5,9 7.991,10 1.515,11 6.442,12 3.144,13 7.003,14 5.144,15 3.144,16 0.105,17 23,18 6,19 395.843,20 7.982,21 31405,22 3.487,23 3.216,24 5.915,25 8.21,26 1.956,27 1.237,28 8.625,29 9.545,30 10.47,31 11.397,32 12.326,33 3.44,34 6.739,35 5.813,36 8.21,37 13.059,38 10.373,39 12.83,40 15.536,41 17.781,42 20.332,43 22.72,44 25.225,45 27.672,46 30.166,47 25.845,48 32.639,49 35.132,50 29.677,51 37.618,52 1.548,53 0.066,54 3.691,55 8.362,56 10.925,57 13.492,58 16.062,59 18.636,60 7.163,61 3.691,62 6.898,63 6.194}
{0 CHEMBL137009,1 4.443,2 4.443,3 4.5,4 5.3,5 3.997,6 0.545,7 3.997,8 4.234,9 6.751,10 0.434,11 5.965,12 2.799,13 6.251,14 4.799,15 2.799,16 0.121,17 5,18 6,19 396.277,20 7.606,21 24872,22 2.989,23 2.891,24 5.412,25 7.154,26 1.192,27 0.663,28 8.406,29 9.262,30 10.124,31 10.985,32 11.85,33 1.481,34 6.55,35 1.104,36 7.154,37 4.92,38 10.119,39 12.398,40 14.572,41 16.554,42 18.951,43 21.098,44 23.431,45 25.657,46 27.966,47 24.831,48 30.229,49 32.532,50 28.483,51 34.815,52 1.502,53 0.08,54 0.86,55 0.854,56 0.661,57 0.505,58 0.382,59 0.285,60 1.72,61 0.86,62 6.224,63 6.119}
{0 CHEMBL137094,1 4.956,2 5.088,3 5.215,4 4.6,5 4.49,6 0.784,7 4.49,8 4.754,9 9.796,10 0.823,11 6.446,12 3.471,13 7.072,14 5.471,15 3.471,16 0.111,17 86,18 5,19 524.039,20 8.794,21 106155,22 3.726,23 3.502,24 6.671,25 10.714,26 2.664,27 2.347,28 8.999,29 9.891,30 10.804,31 11.7,32 12.614,33 3.636,34 7.256,35 5.996,36 10.714,37 16.287,38 10.766,39 13.13,40 16.234,41 18.542,42 21.085,43 23.507,44 26.021,45 28.494,46 31.004,47 26.791,48 33.502,49 36.017,50 30.695,51 38.529,52 1.591,53 0.069,54 3.784,55 8.585,56 11.207,57 13.837,58 16.469,59 19.103,60 7.434,61 3.784,62 6.767,63 6.638}
{0 CHEMBL137151,1 4.71,2 4.82,3 4.913,4 2.4,5 4.49,6 0.81,7 4.49,8 4.533,9 7.908,10 0.998,11 6.054,12 3.471,13 6.943,14 5.471,15 3.471,16 0.115,17 138,18 8,19 465.401,20 7.866,21 32024,22 3.726,23 3.502,24 6.671,25 10.714,26 2.668,27 2.212,28 8.815,29 9.694,30 10.602,31 11.488,32 12.398,33 3.687,34 7.104,35 6,36 10.714,37 18.127,38 10.595,39 12.918,40 16.13,41 18.46,42 21.01,43 23.447,44 25.969,45 28.451,46 30.968,47 26.709,48 33.473,49 35.993,50 30.627,51 38.509,52 1.591,53 0.072,54 3.784,55 8.585,56 11.207,57 13.837,58 16.469,59 19.103,60 7.434,61 3.784,62 6.271,63 7.032}
{0 CHEMBL137172,1 4.644,2 4.771,3 4.86,4 2.5,5 4.49,6 0.813,7 4.49,8 4.466,9 7.379,10 0.945,11 5.967,12 3.471,13 6.975,14 5.471,15 3.471,16 0.116,17 110,18 7,19 457.311,20 7.768,21 28819,22 3.726,23 3.502,24 6.671,25 10.714,26 2.197,27 2.149,28 8.756,29 9.63,30 10.535,31 11.418,32 12.327,33 3.687,34 7.045,35 6,36 10.714,37 18.127,38 10.529,39 12.848,40 16.079,41 18.421,42 20.977,43 23.422,44 25.949,45 28.436,46 30.957,47 26.669,48 33.464,49 35.986,50 30.596,51 38.504,52 1.571,53 0.072,54 3.784,55 8.585,56 11.207,57 13.837,58 16.469,59 19.103,60 7.434,61 3.784,62 6.191,63 6.638}
{0 CHEMBL137324,1 4.787,2 4.913,3 5.03,4 2.4,5 4.49,6 0.869,7 4.49,8 4.635,9 8.462,10 0.849,11 6.114,12 3.471,13 6.921,14 5.471,15 3.471,16 0.115,17 105,18 7,19 537.947,20 8.201,21 53302,22 3.726,23 3.502,24 6.671,25 10.714,26 2.543,27 2.111,28 8.895,29 9.774,30 10.681,31 11.566,32 12.475,33 3.759,34 7.168,35 6.016,36 10.714,37 20.253,38 10.656,39 12.996,40 16.145,41 18.469,42 21.018,43 23.452,44 25.973,45 28.454,46 30.971,47 26.717,48 33.475,49 35.994,50 30.632,51 38.51,52 1.574,53 0.071,54 3.784,55 8.588,56 11.208,57 13.837,58 16.469,59 19.103,60 7.434,61 3.784,62 6.363,63 6.367}
{0 CHEMBL137352,1 4.787,2 4.898,3 4.977,4 2.2,5 4.49,6 0.816,7 4.49,8 4.625,9 8.588,10 1.02,11 6.147,12 3.471,13 6.965,14 5.471,15 3.471,16 0.115,17 170,18 5,19 540.401,20 8.024,21 40267,22 3.726,23 3.502,24 6.671,25 10.714,26 2.899,27 2.441,28 8.892,29 9.773,30 10.683,31 11.569,32 12.481,33 3.759,34 7.174,35 6.005,36 10.714,37 21.567,38 10.673,39 13,40 16.199,41 18.521,42 21.068,43 23.498,44 26.016,45 28.492,46 31.005,47 26.763,48 33.504,49 36.019,50 30.676,51 38.532,52 1.598,53 0.072,54 3.784,55 8.586,56 11.208,57 13.837,58 16.469,59 19.103,60 7.434,61 3.784,62 6.351,63 6.523}
{0 CHEMBL137390,1 4.466,2 4.605,3 4.727,4 2.9,5 4.49,6 0.793,7 4.49,8 4.304,9 5.853,10 0.945,11 5.74,12 3.471,13 6.921,14 5.471,15 3.471,16 0.111,17 86,18 5,19 333.311,20 7.228,21 12347,22 3.726,23 3.502,24 6.671,25 10.714,26 2.065,27 1.91,28 8.654,29 9.539,30 10.458,31 11.35,32 12.269,33 3.61,34 6.956,35 5.994,36 10.714,37 14.687,38 10.433,39 12.783,40 16.075,41 18.421,42 20.977,43 23.423,44 25.95,45 28.437,46 30.958,47 26.667,48 33.465,49 35.987,50 30.595,51 38.505,52 1.613,53 0.068,54 3.784,55 8.585,56 11.207,57 13.837,58 16.469,59 19.103,60 7.434,61 3.784,62 6.034,63 5.921}
{0 CHEMBL137426,1 4.357,2 4.511,3 4.595,4 3.5,5 4.49,6 0.889,7 4.49,8 4.174,9 5.099,10 1.455,11 5.71,12 3.471,13 7.248,14 5.471,15 3.471,16 0.108,17 93,18 3,19 290.973,20 6.739,21 5810,22 3.726,23 3.502,24 6.671,25 10.714,26 1.895,27 1.886,28 8.48,29 9.375,30 10.306,31 11.207,32 12.136,33 3.584,34 6.806,35 5.993,36 10.714,37 13.087,38 10.278,39 12.644,40 16.046,41 18.404,42 20.966,43 23.416,44 25.945,45 28.435,46 30.956,47 26.651,48 33.464,49 35.986,50 30.586,51 38.504,52 1.641,53 0.066,54 3.784,55 8.585,56 11.207,57 13.837,58 16.469,59 19.103,60 7.434,61 3.784,62 5.995,63 5.357}
{0 CHEMBL137436,1 4.575,2 4.682,3 4.796,4 2.7,5 4.49,6 0.806,7 4.49,8 4.407,9 6.836,10 0.909,11 5.867,12 3.471,13 7.191,14 5.471,15 3.471,16 0.115,17 86,18 5,19 379.311,20 7.526,21 19568,22 3.726,23 3.502,24 6.671,25 10.714,26 2.126,27 1.948,28 8.685,29 9.563,30 10.476,31 11.362,32 12.277,33 3.625,34 6.978,35 5.996,36 10.714,37 15.264,38 10.462,39 12.795,40 16.07,41 18.416,42 20.974,43 23.421,44 25.948,45 28.436,46 30.957,47 26.664,48 33.464,49 35.986,50 30.593,51 38.504,52 1.575,53 0.071,54 3.784,55 8.585,56 11.207,57 13.837,58 16.469,59 19.103,60 7.434,61 3.784,62 6.138,63 6.222}
{0 CHEMBL137514,1 4.369,2 4.533,3 4.635,4 3.3,5 4.49,6 0.817,7 4.49,8 4.19,9 5.175,10 1.612,11 5.717,12 3.471,13 7.297,14 5.471,15 3.471,16 0.109,17 94,18 3,19 297.395,20 6.823,21 6623,22 3.726,23 3.502,24 6.671,25 10.714,26 1.895,27 1.886,28 8.494,29 9.387,30 10.315,31 11.215,32 12.144,33 3.593,34 6.815,35 5.993,36 10.714,37 13.887,38 10.287,39 12.652,40 16.046,41 18.404,42 20.966,43 23.416,44 25.945,45 28.435,46 30.956,47 26.651,48 33.464,49 35.986,50 30.586,51 38.504,52 1.624,53 0.066,54 3.784,55 8.585,56 11.207,57 13.837,58 16.469,59 19.103,60 7.434,61 3.784,62 6.008,63 5.62}
{0 CHEMBL138126,1 4.407,2 4.575,3 4.7,4 3,5 4.49,6 0.871,7 4.49,8 4.248,9 5.447,10 1.873,11 5.73,12 3.471,13 7.165,14 5.471,15 3.471,16 0.113,17 115,18 3,19 326.826,20 7.045,21 9294,22 3.726,23 3.502,24 6.671,25 10.714,26 1.895,27 1.886,28 8.558,29 9.443,30 10.365,31 11.259,32 12.183,33 3.61,34 6.876,35 5.994,36 10.714,37 14.687,38 10.341,39 12.695,40 16.052,41 18.407,42 20.968,43 23.417,44 25.946,45 28.435,46 30.956,47 26.654,48 33.464,49 35.986,50 30.588,51 38.504,52 1.611,53 0.067,54 3.784,55 8.585,56 11.207,57 13.837,58 16.469,59 19.103,60 7.434,61 3.784,62 6.027,63 5.481}
{0 CHEMBL138484,1 4.454,2 4.595,3 4.718,4 4.1,5 4.49,6 0.829,7 4.49,8 4.277,9 5.955,10 1.975,11 5.736,12 3.471,13 6.927,14 5.471,15 3.471,16 0.112,17 137,18 3,19 336.719,20 7.173,21 11382,22 3.726,23 3.502,24 6.671,25 10.714,26 2.135,27 1.941,28 8.598,29 9.478,30 10.395,31 11.285,32 12.206,33 3.636,34 6.917,35 5.996,36 10.714,37 16.287,38 10.374,39 12.72,40 16.055,41 18.408,42 20.968,43 23.417,44 25.946,45 28.435,46 30.956,47 26.656,48 33.464,49 35.986,50 30.588,51 38.504,52 1.608,53 0.07,54 3.784,55 8.585,56 11.207,57 13.837,58 16.469,59 19.103,60 7.434,61 3.784,62 6.032,63 5.77}
{0 CHEMBL138800,1 4.7,2 4.82,3 4.92,4 2.5,5 4.49,6 0.811,7 4.49,8 4.533,9 7.741,10 1.008,11 6.062,12 3.471,13 6.943,14 5.471,15 3.471,16 0.115,17 138,18 9,19 461.401,20 7.829,21 29624,22 3.726,23 3.502,24 6.671,25 10.714,26 2.588,27 2.24,28 8.809,29 9.69,30 10.601,31 11.488,32 12.4,33 3.701,34 7.099,35 6.001,36 10.714,37 18.704,38 10.591,39 12.919,40 16.133,41 18.462,42 21.012,43 23.448,44 25.97,45 28.452,46 30.969,47 26.71,48 33.473,49 35.993,50 30.628,51 38.509,52 1.603,53 0.071,54 3.784,55 8.585,56 11.207,57 13.837,58 16.469,59 19.103,60 7.434,61 3.784,62 6.288,63 6.921}
{0 CHEMBL139134,1 4.595,2 4.736,3 4.92,4 2.6,5 4.276,6 0.534,7 4.276,8 4.304,9 6.484,10 0.72,11 5.857,12 3.132,13 6.712,14 5.132,15 3.132,16 0.104,17 6,18 7,19 323.455,20 7.41,21 15119,22 3.766,23 3.378,24 5.836,25 7.948,26 1.52,27 0.896,28 8.436,29 9.354,30 10.277,31 11.2,32 12.125,33 3.42,34 6.567,35 5.521,36 7.948,37 13.256,38 10.208,39 12.631,40 15.339,41 17.578,42 20.124,43 22.507,44 25.008,45 27.45,46 29.938,47 25.661,48 32.406,49 34.893,50 29.49,51 37.372,52 1.58,53 0.066,54 3.272,55 7.832,56 10.186,57 12.551,58 14.92,59 17.291,60 6.545,61 3.272,62 6.224,63 7.456}
{0 CHEMBL1491,1 4.575,2 4.71,3 4.71,4 3.8,5 4.368,6 0.84,7 4.368,8 4.304,9 6.331,10 1.806,11 6.014,12 3.337,13 7.093,14 5.337,15 3.337,16 0.108,17 73,18 5,19 409.405,20 6.89,21 6922,22 3.51,23 3.18,24 6.134,25 8.771,26 2.418,27 2.007,28 8.468,29 9.376,30 10.297,31 11.211,32 12.136,33 2.861,34 6.627,35 3.475,36 8.771,37 13.458,38 10.225,39 12.644,40 15.582,41 17.884,42 20.47,43 22.911,44 25.455,45 27.952,46 30.486,47 25.933,48 33.006,49 35.539,50 29.806,51 38.068,52 1.583,53 0.066,54 1.674,55 4.252,56 5.119,57 6.042,58 7.004,59 7.989,60 3.349,61 1.674,62 6.268,63 8.699}
{0 CHEMBL15245,1 4.905,2 5.094,3 5.357,4 3.8,5 4.317,6 0.691,7 4.317,8 4.585,9 8.483,10 0.902,11 6.249,12 3.265,13 6.64,14 5.265,15 3.265,16 0.1,17 12,18 5,19 347.173,20 8.458,21 55192,22 3.537,23 3.057,24 6.289,25 9.429,26 1.991,27 0.924,28 8.718,29 9.652,30 10.59,31 11.527,32 12.466,33 2.529,34 6.853,35 3.862,36 9.429,37 7.635,38 10.513,39 12.962,40 15.68,41 17.904,42 20.434,43 22.791,44 25.266,45 27.677,46 30.134,47 26.009,48 32.567,49 35.019,50 29.826,51 37.463,52 1.611,53 0.063,54 2.443,55 5.489,56 7.209,57 8.963,58 10.734,59 12.512,60 4.174,61 2.443,62 6.686,63 7.347}
{0 CHEMBL180561,1 5.081,2 5.165,3 5.236,4 5.8,5 4.612,6 0.551,7 4.612,8 4.836,9 11.227,10 0.739,11 6.431,12 3.61,13 7.765,14 5.61,15 3.61,16 0.112,17 54,18 10,19 617.539,20 8.485,21 70665,22 3.888,23 3.777,24 6.268,25 9.057,26 2.849,27 2.257,28 9.026,29 9.926,30 10.838,31 11.743,32 12.657,33 3.11,34 7.226,35 4.297,36 9.057,37 17.215,38 10.822,39 13.171,40 16.697,41 19.255,42 21.957,43 24.61,44 27.304,45 29.99,46 32.688,47 27.264,48 35.387,49 38.09,50 31.343,51 40.795,52 1.57,53 0.07,54 2.612,55 5.979,56 7.801,57 9.672,58 11.564,59 13.468,60 4.612,61 2.612,62 6.756,63 6}
{0 CHEMBL1835153,1 4.905,2 5.088,3 5.328,4 14,5 4.356,6 0.651,7 4.356,8 4.615,9 8.603,10 0.859,11 7.109,12 3.295,13 6.677,14 5.295,15 3.295,16 0.102,17 41,18 3,19 583.946,20 8.309,21 45354,22 3.569,23 3.256,24 6.26,25 9.354,26 2.33,27 1.577,28 8.858,29 9.775,30 10.708,31 11.632,32 12.567,33 2.829,34 7.057,35 4.569,36 9.354,37 8.8,38 10.625,39 13.068,40 16.02,41 18.322,42 20.872,43 23.294,44 25.808,45 28.279,46 30.783,47 26.486,48 33.273,49 35.776,50 30.373,51 38.275,52 1.614,53 0.064,54 3.02,55 6.666,56 8.85,57 11.055,58 13.264,59 15.474,60 4.53,61 3.02,62 7.695,63 4.523}
{0 CHEMBL193,1 4.511,2 4.615,3 4.585,4 4.7,5 4.375,6 0.635,7 4.375,8 4.263,9 5.861,10 1.37,11 6.086,12 3.354,13 6.869,14 5.354,15 3.354,16 0.106,17 78,18 11,19 432.939,20 6.73,21 5740,22 3.77,23 3.47,24 6.294,25 9.171,26 2.298,27 1.875,28 8.449,29 9.362,30 10.287,31 11.204,32 12.13,33 3.259,34 6.642,35 4.501,36 9.171,37 16.597,38 10.235,39 12.636,40 15.637,41 17.936,42 20.517,43 22.952,44 25.492,45 27.984,46 30.516,47 26.004,48 33.032,49 35.563,50 29.873,51 38.09,52 1.665,53 0.065,54 2.612,55 6.093,56 7.853,57 9.694,58 11.573,59 13.472,60 4.612,61 2.612,62 6.377,63 8.456}
{0 CHEMBL197,1 4.369,2 4.419,3 4.466,4 2.8,5 4.583,6 0.659,7 4.583,8 4.263,9 6.245,10 1.096,11 5.794,12 3.578,13 7.476,14 5.578,15 3.578,16 0.127,17 101,18 13,19 410.351,20 7.034,21 10376,22 3.436,23 3.209,24 6.151,25 9.031,26 2.027,27 1.361,28 8.534,29 9.406,30 10.283,31 11.16,32 12.039,33 3.023,34 6.808,35 4.455,36 9.031,37 13.514,38 10.337,39 12.576,40 16.33,41 18.921,42 21.618,43 24.284,44 26.976,45 29.663,46 32.357,47 26.992,48 35.049,49 37.744,50 31.095,51 40.439,52 1.598,53 0.08,54 2.517,55 6.24,56 8.078,57 9.923,58 11.769,59 13.615,60 5.034,61 2.517,62 5.961,63 7.409}
{0 CHEMBL2051962,1 4.543,2 4.663,3 4.718,4 5.2,5 4.348,6 0.633,7 4.348,8 4.304,9 6.262,10 1.775,11 6.08,12 3.328,13 6.684,14 5.328,15 3.328,16 0.11,17 117,18 10,19 464.257,20 7.054,21 9063,22 3.777,23 3.507,24 6.296,25 9.188,26 2.458,27 1.792,28 8.553,29 9.437,30 10.353,31 11.247,32 12.165,33 3.33,34 6.808,35 4.524,36 9.188,37 18.997,38 10.334,39 12.68,40 15.675,41 17.95,42 20.484,43 22.891,44 25.397,45 27.863,46 30.367,47 26.027,48 32.86,49 35.369,50 29.861,51 37.875,52 1.616,53 0.067,54 2.612,55 6.099,56 7.855,57 9.694,58 11.573,59 13.472,60 4.612,61 2.612,62 6.436,63 6}
{0 CHEMBL2092919,1 4.605,2 4.7,3 4.762,4 3.9,5 4.348,6 0.615,7 4.348,8 4.382,9 7.088,10 2.48,11 6.085,12 3.328,13 7.045,14 5.328,15 3.328,16 0.115,17 123,18 11,19 488.257,20 7.361,21 15446,22 3.777,23 3.484,24 6.296,25 9.188,26 2.538,27 1.736,28 8.624,29 9.496,30 10.399,31 11.284,32 12.193,33 3.33,34 6.86,35 4.524,36 9.188,37 18.997,38 10.382,39 12.714,40 15.676,41 17.95,42 20.484,43 22.891,44 25.397,45 27.863,46 30.367,47 26.027,48 32.86,49 35.369,50 29.861,51 37.875,52 1.553,53 0.072,54 2.612,55 6.099,56 7.855,57 9.694,58 11.573,59 13.472,60 4.612,61 2.612,62 6.442,63 6.304}
{0 CHEMBL2111604,1 4.543,2 4.663,3 4.718,4 5.2,5 4.348,6 0.633,7 4.348,8 4.304,9 6.262,10 1.775,11 6.08,12 3.328,13 6.684,14 5.328,15 3.328,16 0.11,17 117,18 10,19 464.257,20 7.054,21 9063,22 3.777,23 3.507,24 6.296,25 9.188,26 2.458,27 1.792,28 8.553,29 9.437,30 10.353,31 11.247,32 12.165,33 3.33,34 6.808,35 4.524,36 9.188,37 18.997,38 10.334,39 12.68,40 15.675,41 17.95,42 20.484,43 22.891,44 25.397,45 27.863,46 30.367,47 26.027,48 32.86,49 35.369,50 29.861,51 37.875,52 1.616,53 0.067,54 2.612,55 6.099,56 7.855,57 9.694,58 11.573,59 13.472,60 4.612,61 2.612,62 6.436,63 4.863}
{0 CHEMBL23,1 4.635,2 4.804,3 4.956,4 3.6,5 4.207,6 0.577,7 4.207,8 4.331,9 7.166,10 1.41,11 5.883,12 3.068,13 6.572,14 5.068,15 3.068,16 0.11,17 51,18 7,19 417.511,20 7.436,21 15257,22 3.856,23 3.599,24 5.896,25 8.102,26 2.234,27 1.525,28 8.509,29 9.401,30 10.304,31 11.204,32 12.109,33 3.755,34 6.671,35 5.713,36 8.102,37 20.742,38 10.211,39 12.629,40 15.242,41 17.401,42 19.909,43 22.218,44 24.672,45 27.046,46 29.482,47 25.562,48 31.887,49 34.32,50 29.344,51 36.74,52 1.563,53 0.07,54 3.272,55 7.937,56 10.243,57 12.583,58 14.938,59 17.301,60 6.545,61 3.272,62 6.215,63 6.277}
{0 CHEMBL24086,1 5.069,2 5.298,3 5.541,4 3.8,5 4.723,6 0.773,7 4.723,8 4.718,9 9.459,10 0.823,11 6.76,12 3.559,13 8.08,14 5.559,15 3.559,16 0.097,17 12,18 5,19 424.239,20 8.054,21 30364,22 3.838,23 3.239,24 6.242,25 9.128,26 2.258,27 1.904,28 8.867,29 9.824,30 10.788,31 11.752,32 12.719,33 3.547,34 7.022,35 6.181,36 9.128,37 12.13,38 10.663,39 13.198,40 16.993,41 19.677,42 22.483,43 25.248,44 28.045,45 30.833,46 33.631,47 27.598,48 36.427,49 39.226,50 31.783,51 42.025,52 1.598,53 0.06,54 4.196,55 8.948,56 11.739,57 14.545,58 17.365,59 20.195,60 7.812,61 4.196,62 7.285,63 7.585}
{0 CHEMBL24675,1 4.956,2 5.1,3 5.288,4 2.9,5 4.282,6 0.855,7 4.282,8 4.673,9 9.763,10 0.795,11 6.56,12 3.127,13 6.73,14 5.127,15 3.127,16 0.109,17 26,18 12,19 508.022,20 8.631,21 78413,22 3.442,23 3.245,24 6.165,25 9.125,26 2.453,27 1.411,28 8.82,29 9.722,30 10.631,31 11.54,32 12.454,33 3.505,34 6.956,35 5.818,36 9.125,37 15.642,38 10.571,39 12.968,40 15.554,41 17.758,42 20.287,43 22.653,44 25.145,45 27.581,46 30.067,47 25.847,48 32.535,49 35.024,50 29.649,51 37.506,52 1.554,53 0.069,54 3.691,55 8.363,56 10.925,57 13.492,58 16.062,59 18.636,60 7.163,61 3.691,62 6.965,63 8.081}
{0 CHEMBL275195,1 4.796,2 4.984,3 5.193,4 3.9,5 4.298,6 0.892,7 4.298,8 4.489,9 7.778,10 1.113,11 6.448,12 3.145,13 6.749,14 5.145,15 3.145,16 0.103,17 27,18 7,19 390.125,20 7.841,21 25573,22 3.487,23 3.238,24 5.92,25 8.238,26 1.991,27 1.372,28 8.621,29 9.543,30 10.474,31 11.402,32 12.335,33 3.46,34 6.751,35 5.815,36 8.238,37 13.922,38 10.377,39 12.836,40 15.546,41 17.788,42 20.34,43 22.726,44 25.232,45 27.679,46 30.173,47 25.852,48 32.647,49 35.14,50 29.683,51 37.626,52 1.584,53 0.065,54 3.691,55 8.362,56 10.925,57 13.492,58 16.062,59 18.636,60 7.163,61 3.691,62 6.902,63 6.796}
{0 CHEMBL277363,1 4.7,2 4.883,3 5.088,4 4.3,5 4.282,6 0.924,7 4.282,8 4.394,9 7.103,10 1.03,11 6.362,12 3.126,13 6.73,14 5.126,15 3.126,16 0.104,17 15,18 7,19 348.579,20 7.673,21 20887,22 3.442,23 3.237,24 5.89,25 8.188,26 1.68,27 1.14,28 8.527,29 9.444,30 10.37,31 11.293,32 12.222,33 3.412,34 6.653,35 5.812,36 8.188,37 12.202,38 10.279,39 12.726,40 15.402,41 17.643,42 20.194,43 22.583,44 25.09,45 27.54,46 30.035,47 25.706,48 32.511,49 35.005,50 29.536,51 37.492,52 1.568,53 0.065,54 3.691,55 8.362,56 10.925,57 13.492,58 16.062,59 18.636,60 7.163,61 3.691,62 6.823,63 7.523}
{0 CHEMBL29835,1 4.174,2 4.174,3 4.263,4 8.3,5 4.156,6 0.809,7 4.156,8 3.989,9 4.854,10 0.894,11 6.018,12 3.065,13 6.607,14 5.065,15 3.065,16 0.113,17 4,18 9,19 266.335,20 6.485,21 4603,22 2.798,23 2.053,24 5.134,25 5.879,26 0.693,27 0.455,28 8.095,29 8.984,30 9.876,31 10.769,32 11.663,33 0.278,34 6.217,35 0.05,36 5.879,37 0.8,38 9.807,39 12.19,40 14.853,41 17.045,42 19.539,43 21.859,44 24.299,45 26.673,46 29.096,47 25.171,48 31.492,49 33.91,50 28.957,51 36.317,52 1.524,53 0.076,54 0.4,55 0.008,56 0.001,60 0.8,61 0.4,62 6.443,63 4}
{0 CHEMBL31410,1 4.905,2 5.094,3 5.357,4 3.8,5 4.317,6 0.691,7 4.317,8 4.585,9 8.483,10 0.902,11 6.249,12 3.265,13 6.64,14 5.265,15 3.265,16 0.1,17 12,18 5,19 347.173,20 8.458,21 55192,22 3.537,23 3.057,24 6.289,25 9.429,26 1.991,27 0.924,28 8.718,29 9.652,30 10.59,31 11.527,32 12.466,33 2.529,34 6.853,35 3.862,36 9.429,37 7.635,38 10.513,39 12.962,40 15.68,41 17.904,42 20.434,43 22.791,44 25.266,45 27.677,46 30.134,47 26.009,48 32.567,49 35.019,50 29.826,51 37.463,52 1.611,53 0.063,54 2.443,55 5.489,56 7.209,57 8.963,58 10.734,59 12.512,60 4.174,61 2.443,62 6.686,63 5.903}
{0 CHEMBL317651,1 4.913,2 5.056,3 5.075,4 2.9,5 4.402,6 0.75,7 4.402,8 4.673,9 8.912,10 1.298,11 6.596,12 3.384,13 7.004,14 5.384,15 3.384,16 0.11,17 62,18 9,19 554.416,20 8.215,21 46319,22 3.514,23 3.185,24 6.298,25 9.225,26 2.706,27 2.284,28 8.826,29 9.732,30 10.653,31 11.563,32 12.487,33 2.697,34 6.982,35 3.31,36 9.225,37 11.372,38 10.575,39 12.996,40 15.83,41 18.113,42 20.689,43 23.125,44 25.667,45 28.166,46 30.704,47 26.172,48 33.231,49 35.773,50 30.032,51 38.313,52 1.592,53 0.066,54 1.674,55 4.106,56 5.002,57 5.957,58 6.944,59 7.949,60 3.349,61 1.674,62 6.905,63 7.971}
{0 CHEMBL323782,1 4.718,2 4.875,3 4.875,4 3.2,5 4.402,6 0.754,7 4.402,8 4.5,9 7.257,10 1.386,11 6.169,12 3.384,13 7.037,14 5.384,15 3.384,16 0.111,17 62,18 9,19 490.416,20 7.51,21 17605,22 3.514,23 3.184,24 6.298,25 9.203,26 2.262,27 2.256,28 8.658,29 9.563,30 10.487,31 11.399,32 12.327,33 2.697,34 6.815,35 3.31,36 9.203,37 11.372,38 10.384,39 12.834,40 15.735,41 18.043,42 20.632,43 23.083,44 25.634,45 28.142,46 30.687,47 26.086,48 33.218,49 35.764,50 29.964,51 38.306,52 1.585,53 0.065,54 1.674,55 4.106,56 5.002,57 5.957,58 6.944,59 7.949,60 3.349,61 1.674,62 6.433,63 7.604}
{0 CHEMBL324822,1 3.932,2 3.892,3 4.007,4 7.7,5 4.007,6 0.968,7 4.007,8 3.829,9 4.16,11 5.221,12 3.001,13 6.301,14 5.001,15 3.001,16 0.127,19 237.493,20 6.246,21 3334,22 3.048,23 2.361,24 5.247,25 6.4,26 0.347,27 0.337,28 7.946,29 8.788,30 9.635,31 10.48,32 11.33,33 1.618,34 6.057,35 1.617,36 6.4,37 4.933,38 9.624,39 11.889,40 14.196,41 16.268,42 18.68,43 20.899,44 23.253,45 25.531,46 27.864,47 24.468,48 30.166,49 32.491,50 28.166,51 34.804,52 1.455,53 0.083,54 1.263,55 1.818,56 2.125,57 2.494,58 2.9,59 3.33,60 2.232,61 1.263,62 5.602,63 6}
{0 CHEMBL325811,1 4.963,2 5.153,3 5.257,4 2.9,5 4.422,6 0.744,7 4.422,8 4.71,9 9.157,10 1.258,11 6.572,12 3.403,13 7.065,14 5.403,15 3.403,16 0.11,17 62,18 11,19 586.149,20 8.049,21 32492,22 3.516,23 3.209,24 6.298,25 9.203,26 2.654,27 2.347,28 8.858,29 9.767,30 10.693,31 11.611,32 12.542,33 2.697,34 7,35 3.31,36 9.203,37 11.372,38 10.582,39 13.047,40 15.886,41 18.187,42 20.778,43 23.228,44 25.783,45 28.293,46 30.842,47 26.22,48 33.378,49 35.929,50 30.094,51 38.477,52 1.577,53 0.064,54 1.674,55 4.106,56 5.002,57 5.957,58 6.944,59 7.949,60 3.349,61 1.674,62 6.935,63 8.249}
{0 CHEMBL33083,1 4.625,2 4.804,3 4.977,4 2.6,5 4.226,6 0.579,7 4.226,8 4.344,9 6.833,10 0.872,11 6.445,12 3.069,13 6.739,14 5.069,15 3.069,16 0.105,17 7,18 6,19 385.525,20 7.517,21 17606,22 3.667,23 3.335,24 5.965,25 8.393,26 1.603,27 0.994,28 8.46,29 9.37,30 10.287,31 11.203,32 12.122,33 3.348,34 6.581,35 5.289,36 8.393,37 11.358,38 10.144,39 12.632,40 15.301,41 17.504,42 20.027,43 22.368,44 24.838,45 27.24,46 29.695,47 25.608,48 32.125,49 34.577,50 29.411,51 37.021,52 1.549,53 0.068,54 2.95,55 7.352,56 9.459,57 11.587,58 13.726,59 15.874,60 5.9,61 2.95,62 6.926,63 6.658}
{0 CHEMBL331328,1 3.97,2 3.932,3 4.043,4 8.3,5 4.011,6 0.997,7 4.011,8 3.829,9 4.167,11 5.299,12 2.974,13 6.317,14 4.974,15 2.974,16 0.123,19 235.775,20 6.178,21 2960,22 2.973,23 2.361,24 5.247,25 6.4,26 0.577,27 0.257,28 7.937,29 8.789,30 9.646,31 10.502,32 11.36,33 1.814,34 6.043,35 1.944,36 6.4,37 5.51,38 9.616,39 11.912,40 14.237,41 16.312,42 18.74,43 20.965,44 23.33,45 25.616,46 27.959,47 24.494,48 30.269,49 32.603,50 28.199,51 34.924,52 1.456,53 0.08,54 1.322,55 2.229,56 2.604,57 3.039,58 3.516,59 4.019,60 2.303,61 1.322,62 5.687,63 6}
{0 CHEMBL331446,1 4.663,2 4.796,3 4.836,4 2.8,5 4.422,6 0.639,7 4.422,8 4.431,9 7.091,10 2.237,11 6.083,12 3.368,13 7.208,14 5.368,15 3.368,16 0.111,17 142,18 5,19 513.892,20 7.342,21 14322,22 3.894,23 3.485,24 6.394,25 9.951,26 2.756,27 2.382,28 8.697,29 9.582,30 10.506,31 11.403,32 12.33,33 3.6,34 6.978,35 5.539,36 9.951,37 21.422,38 10.485,39 12.84,40 16.117,41 18.468,42 21.037,43 23.494,44 26.034,45 28.537,46 31.073,47 26.593,48 33.598,49 36.137,50 30.502,51 38.674,52 1.577,53 0.068,54 3.825,55 8.077,56 10.738,57 13.417,58 16.1,59 18.783,60 5.5,61 3.825,62 6.361,63 6.631}
{0 CHEMBL33165,1 4.682,2 4.883,3 5.056,4 2.3,5 4.227,6 0.609,7 4.227,8 4.394,9 7.173,10 1.006,11 6.525,12 3.071,13 6.619,14 5.071,15 3.071,16 0.106,17 15,18 8,19 426.071,20 7.709,21 22494,22 3.667,23 3.337,24 5.968,25 8.407,26 1.834,27 1.167,28 8.529,29 9.438,30 10.353,31 11.267,32 12.185,33 3.399,34 6.661,35 5.294,36 8.407,37 13.078,38 10.22,39 12.696,40 15.327,41 17.52,42 20.038,43 22.375,44 24.844,45 27.244,46 29.698,47 25.629,48 32.127,49 34.579,50 29.424,51 37.022,52 1.563,53 0.067,54 2.95,55 7.353,56 9.459,57 11.587,58 13.726,59 15.874,60 5.9,61 2.95,62 6.992,63 6.469}
{0 CHEMBL332316,1 3.989,2 3.951,3 4.094,4 7.1,5 4.009,6 0.954,7 4.009,8 3.892,9 4.396,10 0.418,11 5.242,12 3.002,13 6.301,14 5.002,15 3.002,16 0.126,17 2,19 249.268,20 6.356,21 3846,22 3.268,23 2.361,24 5.247,25 6.4,26 0.347,27 0.337,28 8.038,29 8.888,30 9.741,31 10.594,32 11.449,33 1.738,34 6.18,35 1.755,36 6.4,37 5.725,38 9.733,39 12.003,40 14.392,41 16.459,42 18.856,43 21.059,44 23.397,45 25.658,46 27.976,47 24.703,48 30.264,49 32.577,50 28.39,51 34.878,52 1.495,53 0.083,54 1.325,55 2.032,56 2.443,57 2.922,58 3.438,59 3.975,60 2.304,61 1.325,62 5.631,63 6}
{0 CHEMBL332346,1 4.7,2 4.828,3 4.868,4 1.2,5 4.422,6 0.618,7 4.422,8 4.477,9 7.68,10 2.89,11 6.104,12 3.368,13 7.344,14 5.368,15 3.368,16 0.115,17 108,18 5,19 522.484,20 7.523,21 20019,22 3.892,23 3.48,24 6.296,25 9.188,26 2.596,27 2.271,28 8.691,29 9.577,30 10.49,31 11.39,32 12.311,33 3.546,34 6.899,35 5.531,36 9.188,37 19.022,38 10.445,39 12.824,40 16.014,41 18.373,42 20.963,43 23.432,44 25.986,45 28.498,46 31.043,47 26.505,48 33.574,49 36.118,50 30.431,51 38.659,52 1.521,53 0.07,54 3.825,55 8.076,56 10.737,57 13.417,58 16.1,59 18.783,60 5.5,61 3.825,62 6.387,63 7.804}
{0 CHEMBL334294,1 4.007,2 3.892,3 3.97,4 6.3,5 4.006,6 0.939,7 4.006,8 3.932,9 4.701,10 0.393,11 5.182,12 3.006,13 6.3,14 5.006,15 3.006,16 0.128,17 2,19 257.268,20 6.479,21 4817,22 3.299,23 2.361,24 5.247,25 6.4,26 0.507,27 0.219,28 8.074,29 8.914,30 9.758,31 10.6,32 11.444,33 1.738,34 6.213,35 1.755,36 6.4,37 5.725,38 9.761,39 12.006,40 14.391,41 16.458,42 18.854,43 21.057,44 23.393,45 25.654,46 27.971,47 24.702,48 30.258,49 32.57,50 28.389,51 34.87,52 1.478,53 0.087,54 1.325,55 2.032,56 2.443,57 2.922,58 3.438,59 3.975,60 2.304,61 1.325,62 5.521,63 6}
{0 CHEMBL335343,1 4.754,2 4.844,3 4.977,4 2.4,5 4.49,6 0.785,7 4.49,8 4.554,9 8.323,10 0.846,11 5.929,12 3.471,13 7.191,14 5.471,15 3.471,16 0.115,17 69,18 4,19 410.663,20 8.163,21 47110,22 3.726,23 3.502,24 6.671,25 10.714,26 2.268,27 1.934,28 8.81,29 9.687,30 10.594,31 11.478,32 12.388,33 3.61,34 7.079,35 5.994,36 10.714,37 14.687,38 10.586,39 12.908,40 16.093,41 18.428,42 20.983,43 23.426,44 25.952,45 28.438,46 30.958,47 26.676,48 33.465,49 35.987,50 30.6,51 38.505,52 1.554,53 0.072,54 3.784,55 8.585,56 11.207,57 13.837,58 16.469,59 19.103,60 7.434,61 3.784,62 6.21,63 6.678}
{0 CHEMBL33609,1 4.71,2 4.927,3 5.118,4 2,5 4.227,6 0.601,7 4.227,8 4.431,9 7.325,10 1.304,11 6.539,12 3.071,13 6.71,14 5.071,15 3.071,16 0.109,17 17,18 10,19 436.071,20 7.836,21 26615,22 3.715,23 3.342,24 5.969,25 8.412,26 1.834,27 1.167,28 8.566,29 9.473,30 10.386,31 11.298,32 12.215,33 3.399,34 6.693,35 5.294,36 8.412,37 13.078,38 10.251,39 12.727,40 15.337,41 17.526,42 20.043,43 22.379,44 24.847,45 27.246,46 29.701,47 25.636,48 32.129,49 34.582,50 29.429,51 37.025,52 1.553,53 0.067,54 2.95,55 7.353,56 9.459,57 11.587,58 13.726,59 15.874,60 5.9,61 2.95,62 7.011,63 6.824}
{0 CHEMBL336705,1 4.745,2 4.883,3 5.004,4 2.6,5 4.49,6 0.803,7 4.49,8 4.585,9 7.927,10 0.875,11 6.113,12 3.471,13 6.921,14 5.471,15 3.471,16 0.112,17 86,18 9,19 475.22,20 8.078,21 42348,22 3.726,23 3.502,24 6.671,25 10.714,26 2.303,27 2.084,28 8.841,29 9.726,30 10.64,31 11.53,32 12.445,33 3.737,34 7.116,35 6.015,36 10.714,37 19.11,38 10.61,39 12.961,40 16.14,41 18.467,42 21.017,43 23.452,44 25.973,45 28.455,46 30.971,47 26.713,48 33.475,49 35.994,50 30.631,51 38.51,52 1.586,53 0.07,54 3.784,55 8.588,56 11.208,57 13.837,58 16.469,59 19.103,60 7.434,61 3.784,62 6.369,63 6.602}
{0 CHEMBL341710,1 4.443,2 4.605,3 4.718,4 2.7,5 4.49,6 0.826,7 4.49,8 4.277,9 5.796,10 2.131,11 5.74,12 3.471,13 7.3,14 5.471,15 3.471,16 0.114,17 117,18 3,19 344.947,20 7.173,21 11458,22 3.726,23 3.502,24 6.671,25 10.714,26 1.975,27 1.941,28 8.583,29 9.465,30 10.383,31 11.274,32 12.196,33 3.65,34 6.893,35 5.997,36 10.714,37 16.407,38 10.357,39 12.709,40 16.053,41 18.407,42 20.968,43 23.417,44 25.946,45 28.435,46 30.956,47 26.654,48 33.464,49 35.986,50 30.588,51 38.504,52 1.588,53 0.069,54 3.784,55 8.585,56 11.207,57 13.837,58 16.469,59 19.103,60 7.434,61 3.784,62 6.032,63 6.076}
{0 CHEMBL344252,1 4.625,2 4.727,3 4.844,4 2.5,5 4.49,6 0.876,7 4.49,8 4.466,9 7.344,10 0.878,11 5.875,12 3.471,13 7.191,14 5.471,15 3.471,16 0.117,17 105,18 5,19 442.038,20 7.7,21 26143,22 3.726,23 3.502,24 6.671,25 10.714,26 2.286,27 2.087,28 8.749,29 9.62,30 10.526,31 11.406,32 12.316,33 3.65,34 7.038,35 5.997,36 10.714,37 16.407,38 10.515,39 12.837,40 16.076,41 18.418,42 20.976,43 23.421,44 25.948,45 28.436,46 30.957,47 26.667,48 33.464,49 35.986,50 30.595,51 38.504,52 1.561,53 0.073,54 3.784,55 8.585,56 11.207,57 13.837,58 16.469,59 19.103,60 7.434,61 3.784,62 6.146,63 6.377}
{0 CHEMBL344472,1 4.89,2 5.024,3 5.142,4 2.4,5 4.49,6 0.789,7 4.49,8 4.663,9 9.075,10 0.987,11 6.235,12 3.471,13 6.931,14 5.471,15 3.471,16 0.11,17 117,18 9,19 485.754,20 8.42,21 61779,22 3.726,23 3.503,24 6.671,25 10.714,26 2.953,27 2.24,28 8.916,29 9.809,30 10.726,31 11.623,32 12.539,33 3.701,34 7.185,35 6.001,36 10.714,37 18.704,38 10.714,39 13.054,40 16.197,41 18.511,42 21.057,43 23.484,44 26.001,45 28.477,46 30.99,47 26.756,48 33.49,49 36.007,50 30.665,51 38.52,52 1.608,53 0.069,54 3.784,55 8.585,56 11.207,57 13.837,58 16.469,59 19.103,60 7.434,61 3.784,62 6.471,63 6.699}
{0 CHEMBL386435,1 4.143,2 4.043,3 3.97,4 5.1,5 4.522,6 0.597,7 4.522,8 3.97,9 4.464,10 0.627,11 5.211,12 3.321,13 7.593,14 5.321,15 3.321,16 0.11,17 10,18 6,19 272.727,20 6.18,21 2796,22 3.134,23 2.889,24 5.338,25 6.673,26 1.468,27 0.702,28 8.269,29 9.169,30 10.09,31 10.994,32 11.918,33 0.495,34 6.512,35 0.097,36 6.673,37 1.6,38 10.074,39 12.428,40 16.095,41 18.629,42 21.32,43 23.937,44 26.605,45 29.25,46 31.911,47 26.765,48 34.565,49 37.224,50 30.843,51 39.881,52 1.565,53 0.072,54 0.4,55 0.016,56 0.003,60 0.8,61 0.4,62 5.213,63 5.52}
{0 CHEMBL405355,1 5.112,2 5.193,3 5.298,4 3.6,5 4.612,6 0.599,7 4.612,8 4.852,9 11.553,10 0.861,11 6.507,12 3.61,13 7.765,14 5.61,15 3.61,16 0.11,17 55,18 11,19 654.961,20 8.497,21 68781,22 3.901,23 3.777,24 6.296,25 9.188,26 2.849,27 2.118,28 9.038,29 9.943,30 10.857,31 11.766,32 12.682,33 3.329,34 7.235,35 4.511,36 9.188,37 19.557,38 10.832,39 13.195,40 16.709,41 19.263,42 21.965,43 24.617,44 27.31,45 29.995,46 32.693,47 27.271,48 35.391,49 38.094,50 31.348,51 40.798,52 1.581,53 0.07,54 2.612,55 6.094,56 7.853,57 9.694,58 11.573,59 13.472,60 4.612,61 2.612,62 6.883,63 8.046}
{0 CHEMBL410937,1 4.682,2 4.812,3 4.852,4 2.6,5 4.422,6 0.634,7 4.422,8 4.454,9 7.341,10 2.45,11 6.088,12 3.368,13 7.259,14 5.368,15 3.368,16 0.112,17 144,18 5,19 521.892,20 7.435,21 16907,22 3.894,23 3.485,24 6.394,25 9.951,26 2.756,27 2.382,28 8.719,29 9.599,30 10.52,31 11.415,32 12.339,33 3.6,34 6.993,35 5.539,36 9.951,37 21.422,38 10.499,39 12.851,40 16.118,41 18.468,42 21.037,43 23.494,44 26.034,45 28.537,46 31.073,47 26.593,48 33.598,49 36.137,50 30.503,51 38.674,52 1.56,53 0.069,54 3.825,55 8.077,56 10.738,57 13.417,58 16.1,59 18.783,60 5.5,61 3.825,62 6.364,63 7.762}
{0 CHEMBL416040,1 4.673,2 4.86,3 5.056,4 2.1,5 4.226,6 0.57,7 4.226,8 4.394,9 7.299,10 1.335,11 6.462,12 3.07,13 6.802,14 5.07,15 3.07,16 0.108,17 10,18 8,19 399.525,20 7.712,21 22917,22 3.715,23 3.34,24 5.966,25 8.398,26 1.683,27 0.994,28 8.513,29 9.42,30 10.332,31 11.245,32 12.162,33 3.348,34 6.627,35 5.289,36 8.398,37 11.358,38 10.188,39 12.674,40 15.311,41 17.51,42 20.032,43 22.371,44 24.842,45 27.243,46 29.698,47 25.615,48 32.127,49 34.58,50 29.416,51 37.024,52 1.532,53 0.069,54 2.95,55 7.352,56 9.459,57 11.587,58 13.726,59 15.874,60 5.9,61 2.95,62 6.949,63 6.215}
{0 CHEMBL423535,1 4.71,2 4.828,3 4.913,4 2.4,5 4.49,6 0.814,7 4.49,8 4.543,9 7.926,10 0.988,11 6.053,12 3.471,13 6.97,14 5.471,15 3.471,16 0.116,17 138,18 7,19 498.856,20 7.902,21 34519,22 3.726,23 3.502,24 6.671,25 10.714,26 2.508,27 2.267,28 8.824,29 9.701,30 10.607,31 11.491,32 12.4,33 3.724,34 7.111,35 6.003,36 10.714,37 19.847,38 10.601,39 12.921,40 16.13,41 18.46,42 21.01,43 23.447,44 25.969,45 28.451,46 30.968,47 26.709,48 33.473,49 35.993,50 30.627,51 38.509,52 1.584,53 0.072,54 3.784,55 8.585,56 11.208,57 13.837,58 16.469,59 19.103,60 7.434,61 3.784,62 6.265,63 6.745}
{0 CHEMBL431669,1 3.932,2 3.85,3 3.97,4 7.1,5 4.006,6 0.956,7 4.006,8 3.85,9 4.29,11 5.171,12 3.005,13 6.3,14 5.005,15 3.005,16 0.129,19 241.493,20 6.312,21 3742,22 3.062,23 2.361,24 5.247,25 6.4,26 0.347,27 0.163,28 7.965,29 8.801,30 9.642,31 10.482,32 11.325,33 1.618,34 6.075,35 1.617,36 6.4,37 4.933,38 9.64,39 11.889,40 14.194,41 16.267,42 18.677,43 20.896,44 23.249,45 25.527,46 27.86,47 24.467,48 30.162,49 32.487,50 28.164,51 34.799,52 1.446,53 0.086,54 1.263,55 1.818,56 2.125,57 2.494,58 2.9,59 3.33,60 2.232,61 1.263,62 5.545,63 6}
{0 CHEMBL432982,1 4.382,2 4.407,3 4.477,4 6.1,5 4.007,6 0.963,7 4.007,8 4.159,9 6.455,11 5.776,12 3.002,13 6.301,14 5.002,15 3.002,16 0.124,18 2,19 316.493,20 7.198,21 12598,22 3.202,23 2.838,24 5.308,25 6.866,26 0.739,27 0.542,28 8.287,29 9.14,30 9.995,31 10.85,32 11.706,33 1.814,34 6.409,35 1.775,36 6.866,37 6.382,38 9.99,39 12.259,40 14.55,41 16.598,42 18.991,43 21.183,44 23.516,45 25.769,46 28.082,47 24.819,48 30.363,49 32.669,50 28.497,51 34.964,52 1.466,53 0.082,54 1.29,55 1.986,56 2.322,57 2.725,58 3.168,59 3.634,60 2.327,61 1.29,62 6.085,63 6}
{0 CHEMBL433189,1 4.078,2 4.078,3 4.205,4 6.3,5 4.007,6 0.942,7 4.007,8 3.892,9 5.023,11 5.309,12 3.001,13 6.378,14 5.001,15 3.001,16 0.13,18 1,19 249.493,20 6.558,21 5332,22 3.015,23 2.361,24 5.247,25 6.4,26 0.342,27 0.396,28 8.011,29 8.844,30 9.684,31 10.522,32 11.365,33 1.618,34 6.111,35 1.617,36 6.4,37 4.933,38 9.684,39 11.929,40 14.196,41 16.264,42 18.678,43 20.897,44 23.251,45 25.53,46 27.863,47 24.465,48 30.166,49 32.491,50 28.164,51 34.804,52 1.425,53 0.087,54 1.263,55 1.818,56 2.125,57 2.494,58 2.9,59 3.33,60 2.232,61 1.263,62 5.677,63 6}
{0 CHEMBL441653,1 4.382,2 4.394,3 4.5,4 2.7,5 4.606,6 0.971,7 4.606,8 4.205,9 6.636,10 0.639,11 5.549,12 3.601,13 7.903,14 5.601,15 3.601,16 0.125,17 4,18 2,19 279.803,20 7.103,21 11414,22 3.074,23 2.361,24 5.339,25 6.623,26 0.658,27 0.708,28 8.372,29 9.239,30 10.115,31 10.993,32 11.878,33 1.696,34 6.553,35 1.893,36 6.623,37 4.714,38 10.096,39 12.413,40 16.35,41 19.003,42 21.74,43 24.442,44 27.164,45 29.876,46 32.594,47 26.988,48 35.309,49 38.025,50 31.128,51 40.741,52 1.471,53 0.084,54 1.408,55 2.324,56 2.878,57 3.497,58 4.147,59 4.814,60 2.428,61 1.408,62 5.914,63 6}
{0 CHEMBL445063,1 4.094,2 3.951,3 4.06,4 6.3,5 4.007,6 0.939,7 4.007,8 3.932,9 5.098,10 0.393,11 5.216,12 3.006,13 6.3,14 5.006,15 3.006,16 0.128,17 2,19 257.268,20 6.519,21 5011,22 3.271,23 2.361,24 5.247,25 6.4,26 0.564,27 0.174,28 8.074,29 8.915,30 9.759,31 10.601,32 11.447,33 1.738,34 6.213,35 1.755,36 6.4,37 5.725,38 9.814,39 12.008,40 14.389,41 16.448,42 18.848,43 21.048,44 23.387,45 25.647,46 27.965,47 24.695,48 30.252,49 32.565,50 28.381,51 34.866,52 1.469,53 0.086,54 1.325,55 2.032,56 2.443,57 2.922,58 3.438,59 3.975,60 2.304,61 1.325,62 5.572,63 6}
{0 CHEMBL448620,1 5.1,2 5.187,3 5.278,4 4.7,5 4.612,6 0.597,7 4.612,8 4.844,9 11.389,10 0.861,11 6.513,12 3.61,13 7.765,14 5.61,15 3.61,16 0.111,17 55,18 10,19 639.197,20 8.497,21 68781,22 3.867,23 3.776,24 6.296,25 9.188,26 2.929,27 2.229,28 9.034,29 9.938,30 10.85,31 11.759,32 12.674,33 3.201,34 7.233,35 4.354,36 9.188,37 18.324,38 10.83,39 13.187,40 16.705,41 19.261,42 21.963,43 24.615,44 27.309,45 29.994,46 32.692,47 27.269,48 35.39,49 38.093,50 31.347,51 40.797,52 1.582,53 0.07,54 2.612,55 5.996,56 7.806,57 9.673,58 11.564,59 13.468,60 4.612,61 2.612,62 6.861,63 6.152}
{0 CHEMBL539426,1 4.984,2 5.17,3 5.278,4 2.7,5 4.422,6 0.756,7 4.422,8 4.727,9 9.433,10 1.304,11 6.589,12 3.403,13 7.065,14 5.403,15 3.403,16 0.11,17 67,18 13,19 602.961,20 8.116,21 35607,22 3.516,23 3.208,24 6.298,25 9.203,26 2.694,27 2.409,28 8.876,29 9.785,30 10.71,31 11.627,32 12.557,33 2.792,34 7.017,35 3.349,36 9.203,37 13.092,38 10.599,39 13.062,40 15.893,41 18.192,42 20.782,43 23.23,44 25.784,45 28.294,46 30.842,47 26.226,48 33.378,49 35.929,50 30.098,51 38.477,52 1.57,53 0.065,54 1.674,55 4.119,56 5.006,57 5.958,58 6.944,59 7.949,60 3.349,61 1.674,62 6.957,63 7.517}
{0 CHEMBL609700,1 4.543,2 4.663,3 4.718,4 5.2,5 4.348,6 0.633,7 4.348,8 4.304,9 6.262,10 1.775,11 6.08,12 3.328,13 6.684,14 5.328,15 3.328,16 0.11,17 117,18 10,19 464.257,20 7.054,21 9063,22 3.777,23 3.507,24 6.296,25 9.188,26 2.458,27 1.792,28 8.553,29 9.437,30 10.353,31 11.247,32 12.165,33 3.33,34 6.808,35 4.524,36 9.188,37 18.997,38 10.334,39 12.68,40 15.675,41 17.95,42 20.484,43 22.891,44 25.397,45 27.863,46 30.367,47 26.027,48 32.86,49 35.369,50 29.861,51 37.875,52 1.616,53 0.067,54 2.612,55 6.099,56 7.855,57 9.694,58 11.573,59 13.472,60 4.612,61 2.612,62 6.436,63 5.82}
{0 CHEMBL609701,1 4.605,2 4.7,3 4.762,4 3.9,5 4.348,6 0.615,7 4.348,8 4.382,9 7.088,10 2.48,11 6.085,12 3.328,13 7.045,14 5.328,15 3.328,16 0.115,17 123,18 11,19 488.257,20 7.361,21 15446,22 3.777,23 3.484,24 6.296,25 9.188,26 2.538,27 1.736,28 8.624,29 9.496,30 10.399,31 11.284,32 12.193,33 3.33,34 6.86,35 4.524,36 9.188,37 18.997,38 10.382,39 12.714,40 15.676,41 17.95,42 20.484,43 22.891,44 25.397,45 27.863,46 30.367,47 26.027,48 32.86,49 35.369,50 29.861,51 37.875,52 1.553,53 0.072,54 2.612,55 6.099,56 7.855,57 9.694,58 11.573,59 13.472,60 4.612,61 2.612,62 6.442,63 7.003}
