"molecule_id","AMW","C.","pXC50"
{1 7.858,2 26.3,3 6.184}
{0 CHEMBL20,1 11.699,2 21.1,3 7.108}
{0 CHEMBL2021946,1 8.664,2 29.4,3 8.328}
{0 CHEMBL2023162,1 9.958,2 41.2,3 7.47}
{0 CHEMBL2023163,1 8.916,2 25,3 7.684}
{0 CHEMBL2023164,1 7.973,2 25,3 7.86}
{0 CHEMBL2023165,1 7.858,2 26.3,3 9.046}
{0 CHEMBL2023166,1 7.937,2 26.9,3 7.983}
{0 CHEMBL2023168,1 9.166,2 40,3 6.672}
{0 CHEMBL2023169,1 9.701,2 36.8,3 7.231}
{0 CHEMBL2023170,1 7.3,2 28.6,3 7.573}
{0 CHEMBL2023172,1 11.633,2 23.1,3 7.116}
{0 CHEMBL2023719,1 6.627,2 29,3 9.046}
{0 CHEMBL2023720,1 7.095,2 28,3 8.409}
{0 CHEMBL2023721,1 6.627,2 29,3 9.301}
{0 CHEMBL2023722,1 6.083,2 30.2,3 8.42}
{0 CHEMBL2023723,1 7.095,2 28,3 7.66}
{0 CHEMBL2023724,1 8.634,2 23.8,3 6.873}
{0 CHEMBL2023725,1 9.166,2 40,3 8.229}
{0 CHEMBL2023726,1 8.58,2 39.1,3 7.907}
{0 CHEMBL2023727,1 9.072,2 27.8,3 9.097}
{0 CHEMBL2023728,1 10.839,2 27.3,3 7.666}
{0 CHEMBL2023730,1 9.565,2 30,3 7.866}
{0 CHEMBL2334358,1 8.465,2 41.9,3 8.432}
{0 CHEMBL2334359,1 10.609,2 23.5,3 8.824}
{0 CHEMBL2334360,1 12.523,2 35.7,3 8.409}
{0 CHEMBL2334361,1 8.754,2 30.4,3 7.618}
{0 CHEMBL569460,1 9.327,2 23.1,3 6.114}
