{
  "data_features": {
    "feature": [
      {
        "data_type": "nominal",
        "index": "0",
        "is_ignore": "false",
        "is_row_identifier": "true",
        "is_target": "false",
        "name": "molecule_id",
        "nominal_value": [
          "CHEMBL137822",
          "CHEMBL137860",
          "CHEMBL137895",
          "CHEMBL137896",
          "CHEMBL137965",
          "CHEMBL137986",
          "CHEMBL138234",
          "CHEMBL138320",
          "CHEMBL138423",
          "CHEMBL138470",
          "CHEMBL138479",
          "CHEMBL138589",
          "CHEMBL138612",
          "CHEMBL138974",
          "CHEMBL139059",
          "CHEMBL140709",
          "CHEMBL140950",
          "CHEMBL141580",
          "CHEMBL141722",
          "CHEMBL141723",
          "CHEMBL142062",
          "CHEMBL336660",
          "CHEMBL341787",
          "CHEMBL341960",
          "CHEMBL342608",
          "CHEMBL342811",
          "CHEMBL343810",
          "CHEMBL343931",
          "CHEMBL423541",
          "CHEMBL423552"
        ],
        "number_of_missing_values": "0"
      },
      {
        "data_type": "numeric",
        "index": "1",
        "is_ignore": "false",
        "is_row_identifier": "false",
        "is_target": "false",
        "name": "AMW",
        "number_of_missing_values": "0"
      },
      {
        "data_type": "numeric",
        "index": "2",
        "is_ignore": "false",
        "is_row_identifier": "false",
        "is_target": "false",
        "name": "C.",
        "number_of_missing_values": "0"
      },
      {
        "data_type": "numeric",
        "index": "3",
        "is_ignore": "false",
        "is_row_identifier": "false",
        "is_target": "true",
        "name": "pXC50",
        "number_of_missing_values": "0"
      }
    ]
  }
}