{
  "data_set_description": {
    "collection_date": "November 2013",
    "creator": "Dr Jeremy Besnard, Dr Ivan Olier, Dr Noureddin Sadawi, Dr Larisa Soldatova, Dr Crina Grosan, Prof Ross King, Dr Richard Bickerton, Prof Andrew Hopkins and Dr Willem van Hoorn",
    "default_target_attribute": "pXC50",
    "description": "This dataset contains QSAR data (from ChEMBL version 17) showing activity values (unit is pseudo-pCI50) of several compounds on drug target ChEMBL_ID: CHEMBL3071 (TID: 11104), and it has 29 rows and 1194 features (not including molecule IDs and class feature: molecule_id and pXC50). The features represent Molecular Descriptors which were generated from SMILES strings. Missing value imputation was applied to this dataset (By choosing the Median).",
    "description_version": "1",
    "file_id": "3288735",
    "format": "ARFF",
    "id": "25920",
    "licence": "Public",
    "md5_checksum": "7e4105bb6600525c8069d30e9cb82ef7",
    "minio_url": "https://data.openml.org/datasets/0002/25920/dataset_25920.pq",
    "name": "QSAR-DATASET-FOR-DRUG-TARGET-CHEMBL3071",
    "original_data_url": "https://www.ebi.ac.uk/chembl/target/inspect/CHEMBL3071",
    "parquet_url": "https://data.openml.org/datasets/0002/25920/dataset_25920.pq",
    "processing_date": "2018-10-03 23:29:58",
    "row_id_attribute": "molecule_id",
    "status": "deactivated",
    "tag": [
      "MetaQSAR",
      "study_13"
    ],
    "upload_date": "2016-07-14T18:03:14",
    "url": "https://api.openml.org/data/v1/download/3288735/QSAR-DATASET-FOR-DRUG-TARGET-CHEMBL3071.arff",
    "version": "7",
    "visibility": "public"
  }
}