"molecule_id","FCFP4_1024b122","FCFP4_1024b410","FCFP4_1024b444","FCFP4_1024b680","FCFP4_1024b769","FCFP4_1024b236","FCFP4_1024b298","FCFP4_1024b369","FCFP4_1024b913","FCFP4_1024b9","FCFP4_1024b603","FCFP4_1024b153","FCFP4_1024b460","FCFP4_1024b817","FCFP4_1024b632","FCFP4_1024b600","FCFP4_1024b429","FCFP4_1024b412","FCFP4_1024b459","FCFP4_1024b325","FCFP4_1024b859","FCFP4_1024b983","FCFP4_1024b925","FCFP4_1024b649","FCFP4_1024b57","FCFP4_1024b319","FCFP4_1024b33","FCFP4_1024b250","FCFP4_1024b376","FCFP4_1024b1","FCFP4_1024b10","FCFP4_1024b100","FCFP4_1024b1000","FCFP4_1024b1001","FCFP4_1024b1002","FCFP4_1024b1003","FCFP4_1024b1004","FCFP4_1024b1005","FCFP4_1024b1006","FCFP4_1024b1007","FCFP4_1024b1008","FCFP4_1024b1009","FCFP4_1024b101","FCFP4_1024b1010","FCFP4_1024b1011","FCFP4_1024b1012","FCFP4_1024b1013","FCFP4_1024b1014","FCFP4_1024b1015","FCFP4_1024b1016","FCFP4_1024b1017","pXC50"
{17 1,20 1,22 1,23 1,30 1,31 1,52 4.325}
{0 CHEMBL134527,17 1,19 1,23 1,24 1,25 1,26 1,27 1,30 1,31 1,52 8.097}
{0 CHEMBL134578,17 1,19 1,23 1,29 1,30 1,31 1,52 6.504}
{0 CHEMBL136064,17 1,19 1,22 1,23 1,24 1,25 1,26 1,27 1,30 1,31 1,52 8.444}
{0 CHEMBL136068,17 1,19 1,23 1,27 1,30 1,31 1,52 6}
{0 CHEMBL136381,17 1,19 1,24 1,25 1,26 1,27 1,28 1,29 1,30 1,31 1,52 7.509}
{0 CHEMBL136388,17 1,19 1,23 1,30 1,31 1,52 6.359}
{0 CHEMBL136395,10 1,17 1,19 1,28 1,29 1,30 1,31 1,52 6.668}
{0 CHEMBL136429,17 1,19 1,23 1,28 1,29 1,30 1,31 1,52 6.542}
{0 CHEMBL136495,17 1,19 1,23 1,24 1,25 1,26 1,27 1,28 1,30 1,31 1,52 6.565}
{0 CHEMBL136509,17 1,19 1,20 1,23 1,24 1,25 1,26 1,27 1,30 1,31 1,52 7.77}
{0 CHEMBL136590,17 1,19 1,23 1,28 1,29 1,30 1,31 1,52 5.945}
{0 CHEMBL136594,17 1,19 1,29 1,30 1,31 1,52 7}
{0 CHEMBL136615,17 1,18 1,19 1,24 1,25 1,26 1,27 1,28 1,29 1,30 1,31 1,52 7.824}
{0 CHEMBL136621,17 1,19 1,24 1,25 1,26 1,27 1,30 1,31 1,52 6.996}
{0 CHEMBL136622,17 1,19 1,20 1,21 1,24 1,25 1,26 1,27 1,30 1,31 1,52 7.187}
{0 CHEMBL136701,17 1,19 1,24 1,25 1,26 1,27 1,30 1,31 1,52 7.387}
{0 CHEMBL136768,17 1,19 1,23 1,24 1,25 1,26 1,27 1,30 1,31 1,52 7.585}
{0 CHEMBL136789,17 1,19 1,23 1,29 1,30 1,31 1,52 6.682}
{0 CHEMBL136794,17 1,19 1,23 1,24 1,25 1,26 1,27 1,30 1,31 1,52 8.481}
{0 CHEMBL136835,17 1,19 1,24 1,25 1,26 1,27 1,28 1,29 1,30 1,31 1,52 7.42}
{0 CHEMBL136877,17 1,19 1,28 1,29 1,30 1,31 1,52 7}
{0 CHEMBL136963,17 1,19 1,23 1,24 1,25 1,26 1,27 1,28 1,30 1,31 1,52 7.62}
{0 CHEMBL137085,17 1,19 1,24 1,25 1,26 1,27 1,28 1,29 1,30 1,31 1,52 7.62}
{0 CHEMBL137159,17 1,19 1,28 1,29 1,30 1,31 1,52 7.26}
{0 CHEMBL137250,17 1,19 1,22 1,30 1,31 1,52 7}
{0 CHEMBL137321,17 1,19 1,24 1,25 1,26 1,27 1,28 1,29 1,30 1,31 1,52 7.276}
{0 CHEMBL137339,17 1,19 1,23 1,24 1,25 1,26 1,27 1,30 1,31 1,52 6.128}
{0 CHEMBL137502,14 1,15 1,17 1,19 1,22 1,28 1,29 1,30 1,31 1,52 7}
{0 CHEMBL137563,17 1,19 1,28 1,29 1,30 1,31 1,32 1,52 6}
{0 CHEMBL137658,17 1,19 1,23 1,28 1,30 1,31 1,52 7.328}
{0 CHEMBL137768,17 1,19 1,27 1,28 1,29 1,30 1,31 1,52 6.456}
{0 CHEMBL137776,17 1,19 1,23 1,30 1,31 1,52 5}
{0 CHEMBL138281,17 1,19 1,23 1,24 1,25 1,26 1,27 1,30 1,31 1,52 8.222}
{0 CHEMBL138382,17 1,19 1,28 1,29 1,30 1,31 1,52 5}
{0 CHEMBL138992,17 1,19 1,24 1,25 1,26 1,27 1,28 1,29 1,30 1,31 1,52 6.402}
{0 CHEMBL139110,17 1,19 1,28 1,29 1,30 1,31 1,52 7.276}
{0 CHEMBL139370,17 1,19 1,30 1,31 1,52 6.351}
{0 CHEMBL139578,17 1,19 1,22 1,28 1,29 1,30 1,31 1,52 7}
{0 CHEMBL139963,17 1,19 1,23 1,24 1,25 1,26 1,27 1,30 1,31 1,52 8.076}
{0 CHEMBL141319,1 1,2 1,3 1,4 1,5 1,6 1,7 1,8 1,9 1,10 1,11 1,12 1,13 1,14 1,15 1,16 1,18 1,20 1,21 1,22 1,23 1,30 1,31 1,52 9.538}
{0 CHEMBL141392,1 1,2 1,3 1,4 1,5 1,6 1,7 1,8 1,9 1,10 1,11 1,12 1,13 1,14 1,15 1,16 1,18 1,20 1,21 1,22 1,23 1,30 1,31 1,52 8.824}
{0 CHEMBL141438,1 1,2 1,3 1,4 1,5 1,6 1,7 1,8 1,9 1,10 1,11 1,12 1,13 1,14 1,15 1,18 1,20 1,21 1,22 1,23 1,26 1,30 1,31 1,52 8.886}
{0 CHEMBL141485,1 1,2 1,3 1,4 1,5 1,6 1,7 1,8 1,9 1,10 1,11 1,12 1,13 1,14 1,15 1,16 1,18 1,20 1,21 1,22 1,23 1,30 1,31 1,52 8.638}
{0 CHEMBL141494,1 1,2 1,3 1,4 1,5 1,6 1,7 1,8 1,9 1,10 1,11 1,12 1,13 1,14 1,15 1,16 1,18 1,20 1,21 1,22 1,23 1,30 1,31 1,52 8.638}
{0 CHEMBL142211,1 1,2 1,3 1,4 1,5 1,6 1,7 1,8 1,9 1,10 1,11 1,12 1,13 1,14 1,15 1,18 1,20 1,21 1,22 1,23 1,26 1,30 1,31 1,52 8.081}
{0 CHEMBL142277,1 1,2 1,3 1,4 1,5 1,6 1,7 1,8 1,9 1,10 1,11 1,12 1,13 1,14 1,15 1,16 1,18 1,20 1,21 1,22 1,23 1,30 1,31 1,52 8.469}
{0 CHEMBL142456,1 1,2 1,3 1,4 1,5 1,6 1,7 1,8 1,9 1,10 1,11 1,12 1,13 1,14 1,15 1,16 1,18 1,20 1,21 1,22 1,23 1,30 1,31 1,52 8.886}
{0 CHEMBL142850,1 1,2 1,3 1,4 1,5 1,6 1,7 1,8 1,9 1,10 1,11 1,12 1,13 1,14 1,15 1,18 1,20 1,21 1,22 1,23 1,30 1,31 1,52 9.071}
{0 CHEMBL143075,1 1,2 1,3 1,4 1,5 1,6 1,7 1,8 1,9 1,10 1,11 1,12 1,13 1,14 1,15 1,16 1,18 1,20 1,21 1,22 1,23 1,30 1,31 1,50 1,52 8.602}
{0 CHEMBL143447,1 1,2 1,3 1,4 1,5 1,6 1,7 1,8 1,9 1,10 1,11 1,12 1,13 1,14 1,15 1,16 1,18 1,20 1,21 1,22 1,23 1,30 1,31 1,50 1,52 8.824}
{0 CHEMBL267777,10 1,23 1,24 1,25 1,26 1,27 1,30 1,31 1,52 9.086}
{0 CHEMBL275707,11 1,14 1,15 1,22 1,30 1,31 1,52 5.546}
{0 CHEMBL284163,6 1,7 1,8 1,15 1,20 1,21 1,22 1,24 1,25 1,26 1,27 1,30 1,31 1,40 1,52 8.098}
{0 CHEMBL284172,6 1,7 1,8 1,15 1,22 1,24 1,25 1,26 1,27 1,30 1,31 1,40 1,52 8.069}
{0 CHEMBL284778,20 1,21 1,22 1,24 1,25 1,26 1,27 1,30 1,31 1,52 6.764}
{0 CHEMBL284928,20 1,22 1,23 1,30 1,31 1,52 7.565}
{0 CHEMBL285030,20 1,22 1,23 1,30 1,31 1,52 7.68}
{0 CHEMBL285203,18 1,20 1,22 1,23 1,30 1,31 1,52 5.647}
{0 CHEMBL285541,11 1,22 1,23 1,30 1,52 4.9}
{0 CHEMBL285712,20 1,22 1,23 1,24 1,25 1,26 1,27 1,30 1,31 1,52 8.551}
{0 CHEMBL285906,20 1,21 1,22 1,30 1,31 1,52 6.987}
{0 CHEMBL289563,14 1,15 1,20 1,21 1,22 1,30 1,31 1,52 6.215}
{0 CHEMBL289722,20 1,21 1,22 1,30 1,31 1,52 6.483}
{0 CHEMBL291254,20 1,22 1,23 1,24 1,25 1,26 1,27 1,30 1,31 1,52 7.804}
{0 CHEMBL334466,17 1,19 1,23 1,24 1,25 1,26 1,27 1,30 1,31 1,52 6.5}
{0 CHEMBL335019,17 1,19 1,28 1,29 1,30 1,31 1,52 5}
{0 CHEMBL335327,17 1,19 1,24 1,25 1,26 1,27 1,28 1,29 1,30 1,31 1,52 8.046}
{0 CHEMBL337124,17 1,19 1,23 1,24 1,25 1,26 1,27 1,30 1,31 1,52 5.768}
{0 CHEMBL337148,17 1,19 1,23 1,30 1,31 1,52 6.69}
{0 CHEMBL337337,17 1,19 1,23 1,24 1,25 1,26 1,27 1,30 1,31 1,52 8}
{0 CHEMBL337711,17 1,19 1,28 1,29 1,30 1,31 1,52 6.234}
{0 CHEMBL337810,17 1,19 1,23 1,28 1,30 1,31 1,52 6.585}
{0 CHEMBL338310,17 1,20 1,22 1,23 1,30 1,31 1,52 4.146}
{0 CHEMBL339944,17 1,20 1,22 1,30 1,31 1,52 5.046}
{0 CHEMBL341326,17 1,20 1,22 1,30 1,31 1,52 4.746}
{0 CHEMBL342267,17 1,19 1,23 1,24 1,25 1,26 1,27 1,30 1,31 1,52 7.699}
{0 CHEMBL342742,1 1,2 1,3 1,4 1,5 1,6 1,7 1,8 1,9 1,10 1,11 1,12 1,13 1,14 1,15 1,16 1,18 1,20 1,21 1,22 1,23 1,30 1,31 1,52 8.509}
{0 CHEMBL342948,17 1,19 1,23 1,30 1,31 1,52 6.936}
{0 CHEMBL343228,1 1,2 1,3 1,4 1,5 1,6 1,7 1,8 1,9 1,10 1,11 1,12 1,13 1,14 1,15 1,16 1,18 1,20 1,21 1,22 1,23 1,30 1,31 1,47 1,52 8.921}
{0 CHEMBL343838,1 1,2 1,3 1,4 1,5 1,6 1,7 1,8 1,9 1,10 1,11 1,12 1,13 1,14 1,15 1,18 1,20 1,21 1,22 1,23 1,30 1,31 1,33 1,52 9.456}
{0 CHEMBL343926,17 1,19 1,30 1,31 1,52 5.878}
{0 CHEMBL344240,17 1,19 1,23 1,30 1,31 1,52 6}
{0 CHEMBL344422,17 1,19 1,23 1,28 1,30 1,31 1,52 5}
{0 CHEMBL344994,1 1,2 1,3 1,4 1,5 1,6 1,7 1,8 1,9 1,10 1,11 1,12 1,13 1,14 1,15 1,18 1,20 1,21 1,22 1,23 1,30 1,31 1,52 8.824}
{0 CHEMBL34958,20 1,21 1,22 1,24 1,25 1,26 1,27 1,30 1,31 1,52 6.845}
{0 CHEMBL35096,6 1,7 1,8 1,15 1,22 1,24 1,25 1,26 1,27 1,30 1,31 1,40 1,52 7.873}
{0 CHEMBL35536,20 1,23 1,24 1,25 1,26 1,27 1,30 1,31 1,50 1,52 6.273}
{0 CHEMBL356498,1 1,2 1,3 1,4 1,5 1,6 1,7 1,8 1,9 1,10 1,11 1,12 1,13 1,14 1,15 1,16 1,18 1,20 1,21 1,22 1,23 1,30 1,31 1,52 8.538}
{0 CHEMBL356743,1 1,2 1,3 1,4 1,5 1,6 1,7 1,8 1,9 1,10 1,11 1,12 1,13 1,14 1,15 1,16 1,18 1,20 1,21 1,22 1,23 1,30 1,31 1,52 8.62}
{0 CHEMBL35711,20 1,21 1,22 1,24 1,25 1,26 1,27 1,30 1,31 1,52 7.116}
{0 CHEMBL358268,1 1,2 1,3 1,4 1,5 1,6 1,7 1,8 1,9 1,10 1,11 1,12 1,13 1,14 1,15 1,16 1,18 1,20 1,21 1,22 1,23 1,30 1,31 1,52 8.62}
{0 CHEMBL36599,18 1,20 1,22 1,23 1,24 1,25 1,26 1,27 1,29 1,30 1,31 1,52 5.905}
{0 CHEMBL36645,20 1,22 1,23 1,24 1,25 1,26 1,27 1,30 1,31 1,52 9.086}
{0 CHEMBL36992,20 1,21 1,22 1,24 1,25 1,26 1,27 1,30 1,31 1,52 7.611}
{0 CHEMBL37010,20 1,22 1,23 1,30 1,31 1,52 8.184}
{0 CHEMBL37131,20 1,22 1,23 1,24 1,25 1,26 1,27 1,30 1,31 1,52 6.578}
{0 CHEMBL37215,20 1,22 1,23 1,24 1,25 1,26 1,27 1,30 1,31 1,52 8.559}
{0 CHEMBL37285,14 1,15 1,20 1,22 1,23 1,24 1,25 1,26 1,27 1,30 1,31 1,47 1,52 6.481}
{0 CHEMBL37385,20 1,22 1,23 1,24 1,25 1,26 1,27 1,30 1,31 1,52 8.526}
{0 CHEMBL37483,14 1,15 1,20 1,22 1,30 1,31 1,52 6.547}
{0 CHEMBL37717,20 1,22 1,23 1,30 1,31 1,52 6.056}
{0 CHEMBL38078,20 1,22 1,23 1,24 1,25 1,26 1,27 1,30 1,31 1,52 9.071}
{0 CHEMBL38130,20 1,21 1,22 1,30 1,31 1,52 7.245}
{0 CHEMBL38151,20 1,22 1,23 1,24 1,25 1,26 1,27 1,30 1,31 1,52 8.752}
{0 CHEMBL38152,20 1,21 1,22 1,24 1,25 1,26 1,27 1,30 1,31 1,52 7.656}
{0 CHEMBL38309,22 1,30 1,31 1,52 6.672}
{0 CHEMBL38337,20 1,22 1,23 1,24 1,25 1,26 1,27 1,30 1,31 1,52 7.223}
{0 CHEMBL39,21 1,22 1,30 1,52 6.234}
{0 CHEMBL418607,6 1,7 1,8 1,15 1,20 1,21 1,22 1,24 1,25 1,26 1,27 1,30 1,31 1,40 1,52 6.876}
{0 CHEMBL42,13 1,18 1,24 1,25 1,26 1,27 1,29 1,30 1,31 1,35 1,52 7.553}
{0 CHEMBL422627,17 1,19 1,23 1,30 1,31 1,52 7}
{0 CHEMBL422634,17 1,19 1,23 1,28 1,29 1,30 1,31 1,52 6}
{0 CHEMBL423355,17 1,19 1,22 1,28 1,29 1,30 1,31 1,52 6.951}
{0 CHEMBL424281,17 1,19 1,22 1,28 1,29 1,30 1,31 1,52 6.762}
{0 CHEMBL430551,14 1,15 1,20 1,22 1,23 1,24 1,25 1,26 1,27 1,30 1,31 1,52 8.548}
{0 CHEMBL439609,17 1,18 1,19 1,28 1,29 1,30 1,31 1,52 5.936}
{0 CHEMBL440345,17 1,19 1,22 1,24 1,25 1,26 1,27 1,28 1,29 1,30 1,31 1,52 6.928}
{0 CHEMBL442965,17 1,19 1,23 1,24 1,25 1,26 1,27 1,30 1,31 1,52 6.538}
{0 CHEMBL46463,17 1,19 1,28 1,29 1,30 1,31 1,52 5.55}
{0 CHEMBL538532,17 1,19 1,25 1,26 1,27 1,28 1,29 1,30 1,31 1,52 7.387}
{0 CHEMBL539042,17 1,19 1,29 1,30 1,31 1,52 6.728}
{0 CHEMBL539302,17 1,19 1,24 1,25 1,26 1,27 1,28 1,29 1,30 1,31 1,52 7.398}
{0 CHEMBL539358,17 1,19 1,24 1,25 1,26 1,27 1,28 1,29 1,30 1,31 1,52 7.553}
{0 CHEMBL539553,17 1,19 1,23 1,30 1,31 1,32 1,39 1,52 6.027}
{0 CHEMBL539567,17 1,19 1,23 1,24 1,25 1,26 1,27 1,28 1,30 1,31 1,52 6.551}
{0 CHEMBL54,20 1,23 1,24 1,25 1,26 1,27 1,30 1,31 1,52 7.577}
{0 CHEMBL540066,12 1,17 1,19 1,28 1,30 1,31 1,52 5.861}
{0 CHEMBL540322,17 1,19 1,24 1,25 1,26 1,27 1,28 1,29 1,30 1,31 1,52 7.495}
{0 CHEMBL540578,10 1,17 1,19 1,28 1,29 1,30 1,31 1,52 6.565}
{0 CHEMBL540585,17 1,19 1,24 1,25 1,26 1,27 1,29 1,30 1,31 1,39 1,52 7}
{0 CHEMBL541603,17 1,19 1,28 1,29 1,30 1,31 1,49 1,52 5.06}
{0 CHEMBL542246,17 1,19 1,24 1,25 1,26 1,27 1,28 1,29 1,30 1,31 1,52 6.863}
{0 CHEMBL542737,17 1,19 1,23 1,24 1,25 1,26 1,27 1,28 1,30 1,31 1,52 6.896}
{0 CHEMBL542740,17 1,19 1,22 1,23 1,24 1,25 1,26 1,27 1,28 1,30 1,31 1,52 6.6}
{0 CHEMBL543206,17 1,18 1,19 1,23 1,29 1,30 1,31 1,52 6.253}
{0 CHEMBL543412,17 1,19 1,23 1,24 1,25 1,26 1,27 1,30 1,31 1,52 7.824}
{0 CHEMBL543437,17 1,19 1,27 1,30 1,31 1,52 7}
{0 CHEMBL543438,17 1,19 1,25 1,26 1,27 1,28 1,29 1,30 1,31 1,52 5.474}
{0 CHEMBL543439,17 1,19 1,25 1,26 1,27 1,28 1,29 1,30 1,31 1,52 7.06}
{0 CHEMBL543440,17 1,19 1,21 1,23 1,28 1,30 1,31 1,52 6.73}
{0 CHEMBL543674,12 1,14 1,15 1,17 1,19 1,22 1,28 1,30 1,31 1,52 6.507}
{0 CHEMBL543910,17 1,19 1,23 1,29 1,30 1,31 1,52 5.725}
{0 CHEMBL543917,17 1,19 1,23 1,27 1,30 1,31 1,52 6.556}
{0 CHEMBL544146,17 1,19 1,23 1,28 1,30 1,31 1,52 6}
{0 CHEMBL544147,17 1,19 1,23 1,24 1,25 1,26 1,27 1,28 1,30 1,31 1,52 6.301}
{0 CHEMBL544372,17 1,19 1,23 1,30 1,31 1,52 6.262}
{0 CHEMBL544375,17 1,19 1,30 1,31 1,52 5.795}
{0 CHEMBL544614,17 1,19 1,23 1,24 1,25 1,26 1,27 1,30 1,31 1,52 6.305}
{0 CHEMBL544616,17 1,19 1,23 1,24 1,25 1,26 1,27 1,30 1,31 1,52 7.921}
{0 CHEMBL544847,17 1,19 1,23 1,28 1,30 1,31 1,52 5.866}
{0 CHEMBL545081,17 1,19 1,23 1,24 1,25 1,26 1,27 1,28 1,29 1,30 1,31 1,52 7}
{0 CHEMBL545546,17 1,19 1,24 1,25 1,26 1,27 1,30 1,31 1,52 6.444}
{0 CHEMBL545549,17 1,19 1,28 1,29 1,30 1,31 1,52 6.943}
{0 CHEMBL545552,17 1,19 1,22 1,23 1,24 1,25 1,26 1,27 1,28 1,30 1,31 1,52 7.602}
{0 CHEMBL545781,17 1,19 1,23 1,28 1,30 1,31 1,52 5}
{0 CHEMBL545784,17 1,19 1,23 1,24 1,25 1,26 1,27 1,28 1,30 1,31 1,52 6}
{0 CHEMBL554678,17 1,19 1,21 1,23 1,28 1,30 1,31 1,52 6.65}
{0 CHEMBL555443,17 1,19 1,24 1,25 1,26 1,27 1,30 1,31 1,52 6.491}
{0 CHEMBL555544,17 1,19 1,21 1,28 1,29 1,30 1,31 1,52 5}
{0 CHEMBL555865,17 1,19 1,24 1,25 1,26 1,27 1,28 1,29 1,30 1,31 1,52 7.585}
{0 CHEMBL555975,17 1,19 1,23 1,30 1,31 1,32 1,52 6}
{0 CHEMBL555993,17 1,19 1,28 1,29 1,30 1,31 1,52 7}
{0 CHEMBL558819,17 1,19 1,23 1,24 1,25 1,26 1,27 1,28 1,30 1,31 1,52 6.504}
{0 CHEMBL60859,9 1,13 1,18 1,20 1,24 1,25 1,26 1,27 1,30 1,31 1,52 6.387}
{0 CHEMBL85,6 1,7 1,8 1,15 1,22 1,23 1,24 1,25 1,26 1,27 1,30 1,31 1,40 1,52 8.824}
