{
  "data_set_description": {
    "collection_date": "November 2013",
    "creator": "Dr Jeremy Besnard, Dr Ivan Olier, Dr Noureddin Sadawi, Dr Larisa Soldatova, Dr Crina Grosan, Prof Ross King, Dr Richard Bickerton, Prof Andrew Hopkins and Dr Willem van Hoorn",
    "default_target_attribute": "pXC50",
    "description": "This dataset contains QSAR data (from ChEMBL version 17) showing activity values (unit is pseudo-pCI50) of several compounds on drug target ChEMBL_ID: CHEMBL1856 (TID: 120), and it has 427 rows and 43 features (not including molecule IDs and class feature: molecule_id and pXC50). The features represent Basic Molecular Descriptors which were generated from SMILES strings.  Missing value imputation was applied to this dataset (By choosing the Median).",
    "description_version": "1",
    "file_id": "3285852",
    "format": "ARFF",
    "id": "25823",
    "licence": "Public",
    "md5_checksum": "dbb5aa2f6c1eb52996c95b2e37e0cd75",
    "minio_url": "https://data.openml.org/datasets/0002/25823/dataset_25823.pq",
    "name": "QSAR-DATASET-FOR-DRUG-TARGET-CHEMBL1856",
    "original_data_url": "https://www.ebi.ac.uk/chembl/target/inspect/CHEMBL1856",
    "parquet_url": "https://data.openml.org/datasets/0002/25823/dataset_25823.pq",
    "processing_date": "2018-10-03 23:19:17",
    "row_id_attribute": "molecule_id",
    "status": "deactivated",
    "tag": [
      "MetaQSAR",
      "study_13"
    ],
    "upload_date": "2016-07-14T17:49:53",
    "url": "https://api.openml.org/data/v1/download/3285852/QSAR-DATASET-FOR-DRUG-TARGET-CHEMBL1856.arff",
    "version": "7",
    "visibility": "public"
  }
}