"molecule_id","FCFP4_1024b403","FCFP4_1024b194","FCFP4_1024b435","FCFP4_1024b444","FCFP4_1024b762","FCFP4_1024b119","FCFP4_1024b492","FCFP4_1024b680","FCFP4_1024b165","FCFP4_1024b815","FCFP4_1024b33","FCFP4_1024b480","FCFP4_1024b376","FCFP4_1024b697","FCFP4_1024b463","FCFP4_1024b162","FCFP4_1024b331","FCFP4_1024b855","FCFP4_1024b911","FCFP4_1024b360","FCFP4_1024b395","FCFP4_1024b964","FCFP4_1024b4","FCFP4_1024b48","FCFP4_1024b107","FCFP4_1024b170","FCFP4_1024b54","FCFP4_1024b412","FCFP4_1024b208","FCFP4_1024b65","FCFP4_1024b668","FCFP4_1024b714","FCFP4_1024b281","FCFP4_1024b986","FCFP4_1024b152","FCFP4_1024b520","FCFP4_1024b185","FCFP4_1024b971","FCFP4_1024b804","FCFP4_1024b8","FCFP4_1024b524","FCFP4_1024b904","FCFP4_1024b17","FCFP4_1024b468","FCFP4_1024b683","FCFP4_1024b461","FCFP4_1024b231","FCFP4_1024b438","FCFP4_1024b283","FCFP4_1024b18","FCFP4_1024b417","pXC50"
{7 1,10 1,11 1,20 1,23 1,31 1,32 1,36 1,40 1,46 1,48 1,52 4.31}
{0 CHEMBL1089852,7 1,20 1,23 1,31 1,32 1,36 1,40 1,48 1,52 4.244}
{0 CHEMBL1092243,7 1,20 1,23 1,31 1,32 1,36 1,40 1,52 5.174}
{0 CHEMBL1092727,7 1,20 1,23 1,31 1,32 1,36 1,40 1,48 1,52 4.284}
{0 CHEMBL121053,3 1,4 1,6 1,7 1,8 1,10 1,11 1,12 1,14 1,20 1,23 1,31 1,40 1,52 8.691}
{0 CHEMBL131922,7 1,20 1,23 1,31 1,32 1,36 1,40 1,43 1,50 1,52 4.398}
{0 CHEMBL140197,7 1,20 1,23 1,31 1,32 1,40 1,52 8.35}
{0 CHEMBL143210,7 1,20 1,23 1,26 1,31 1,39 1,40 1,43 1,47 1,52 4}
{0 CHEMBL143267,7 1,20 1,23 1,31 1,32 1,40 1,52 6.523}
{0 CHEMBL144151,7 1,9 1,12 1,13 1,14 1,20 1,23 1,26 1,30 1,31 1,39 1,40 1,43 1,46 1,52 7.298}
{0 CHEMBL144201,7 1,10 1,11 1,12 1,14 1,20 1,23 1,31 1,40 1,52 4.221}
{0 CHEMBL144678,7 1,10 1,11 1,12 1,14 1,20 1,23 1,31 1,40 1,46 1,52 4}
{0 CHEMBL144747,3 1,4 1,6 1,7 1,8 1,10 1,11 1,12 1,14 1,20 1,23 1,31 1,32 1,40 1,52 4}
{0 CHEMBL1629715,10 1,11 1,13 1,16 1,17 1,18 1,19 1,21 1,23 1,24 1,25 1,26 1,27 1,28 1,29 1,31 1,33 1,34 1,35 1,38 1,39 1,43 1,46 1,50 1,51 1,52 7.745}
{0 CHEMBL1629844,10 1,11 1,13 1,16 1,17 1,18 1,19 1,21 1,23 1,24 1,25 1,26 1,27 1,28 1,29 1,31 1,33 1,34 1,35 1,38 1,39 1,43 1,46 1,50 1,51 1,52 8.151}
{0 CHEMBL1629845,10 1,11 1,13 1,16 1,17 1,18 1,19 1,21 1,23 1,24 1,25 1,26 1,27 1,28 1,29 1,31 1,33 1,34 1,35 1,38 1,39 1,43 1,46 1,50 1,51 1,52 7.886}
{0 CHEMBL1629846,10 1,11 1,13 1,16 1,17 1,18 1,19 1,21 1,23 1,24 1,25 1,26 1,27 1,28 1,29 1,31 1,33 1,34 1,35 1,38 1,39 1,43 1,46 1,50 1,51 1,52 7.699}
{0 CHEMBL1629847,10 1,11 1,13 1,16 1,17 1,18 1,19 1,21 1,23 1,24 1,25 1,26 1,27 1,28 1,29 1,31 1,33 1,34 1,35 1,38 1,39 1,43 1,46 1,50 1,51 1,52 8}
{0 CHEMBL1629848,10 1,11 1,13 1,16 1,17 1,18 1,19 1,21 1,23 1,24 1,25 1,26 1,27 1,28 1,29 1,31 1,33 1,34 1,35 1,38 1,39 1,43 1,46 1,50 1,51 1,52 6.796}
{0 CHEMBL1629849,10 1,11 1,13 1,16 1,17 1,18 1,19 1,21 1,23 1,24 1,25 1,26 1,27 1,28 1,29 1,31 1,33 1,34 1,35 1,38 1,39 1,43 1,46 1,50 1,51 1,52 7.066}
{0 CHEMBL1629850,10 1,11 1,13 1,16 1,17 1,18 1,19 1,21 1,23 1,24 1,25 1,26 1,27 1,28 1,29 1,31 1,33 1,34 1,35 1,38 1,39 1,43 1,46 1,50 1,51 1,52 7.444}
{0 CHEMBL1629851,10 1,11 1,13 1,16 1,17 1,18 1,19 1,21 1,23 1,24 1,25 1,26 1,27 1,28 1,29 1,31 1,33 1,34 1,35 1,38 1,39 1,43 1,46 1,50 1,51 1,52 6.893}
{0 CHEMBL1629852,2 1,10 1,11 1,13 1,16 1,17 1,18 1,19 1,21 1,23 1,24 1,25 1,26 1,27 1,28 1,29 1,31 1,33 1,34 1,35 1,38 1,39 1,43 1,46 1,50 1,51 1,52 7.301}
{0 CHEMBL1629853,10 1,11 1,13 1,16 1,17 1,18 1,19 1,21 1,23 1,24 1,25 1,26 1,27 1,28 1,29 1,31 1,33 1,34 1,35 1,38 1,39 1,43 1,46 1,50 1,51 1,52 7.479}
{0 CHEMBL1629854,10 1,11 1,13 1,16 1,17 1,18 1,19 1,21 1,23 1,24 1,25 1,26 1,27 1,28 1,29 1,31 1,33 1,34 1,35 1,38 1,39 1,43 1,46 1,50 1,51 1,52 7.748}
{0 CHEMBL1629855,10 1,11 1,13 1,16 1,17 1,18 1,19 1,21 1,23 1,24 1,25 1,26 1,27 1,28 1,29 1,31 1,33 1,34 1,35 1,39 1,43 1,46 1,50 1,51 1,52 8.523}
{0 CHEMBL1629856,10 1,11 1,13 1,16 1,17 1,18 1,19 1,21 1,23 1,24 1,25 1,26 1,27 1,28 1,29 1,31 1,33 1,34 1,35 1,39 1,43 1,46 1,50 1,51 1,52 8.549}
{0 CHEMBL1629857,10 1,11 1,13 1,16 1,17 1,18 1,19 1,21 1,23 1,24 1,25 1,26 1,27 1,28 1,29 1,31 1,33 1,34 1,35 1,39 1,43 1,46 1,50 1,51 1,52 8.549}
{0 CHEMBL1629858,7 1,10 1,11 1,13 1,16 1,17 1,18 1,19 1,21 1,23 1,24 1,25 1,26 1,27 1,28 1,29 1,31 1,33 1,34 1,35 1,39 1,43 1,46 1,50 1,51 1,52 7.839}
{0 CHEMBL1629859,10 1,11 1,13 1,16 1,17 1,18 1,19 1,21 1,23 1,24 1,25 1,26 1,27 1,28 1,29 1,31 1,33 1,34 1,35 1,39 1,43 1,46 1,50 1,51 1,52 8.199}
{0 CHEMBL1629860,10 1,11 1,13 1,16 1,17 1,18 1,19 1,21 1,23 1,24 1,25 1,26 1,27 1,28 1,29 1,31 1,33 1,34 1,35 1,39 1,43 1,46 1,50 1,51 1,52 8.155}
{0 CHEMBL1629861,10 1,11 1,13 1,16 1,17 1,18 1,19 1,21 1,23 1,24 1,25 1,26 1,27 1,28 1,29 1,30 1,31 1,33 1,34 1,35 1,38 1,39 1,43 1,46 1,50 1,52 6.996}
{0 CHEMBL1629862,10 1,11 1,13 1,16 1,17 1,18 1,19 1,21 1,23 1,24 1,25 1,26 1,27 1,28 1,29 1,31 1,33 1,34 1,35 1,38 1,39 1,43 1,46 1,50 1,52 8.097}
{0 CHEMBL1629863,11 1,13 1,16 1,17 1,18 1,19 1,21 1,23 1,24 1,25 1,26 1,27 1,28 1,29 1,30 1,33 1,34 1,35 1,38 1,39 1,43 1,46 1,50 1,52 8.31}
{0 CHEMBL1629864,11 1,13 1,16 1,17 1,18 1,19 1,21 1,23 1,24 1,25 1,26 1,27 1,28 1,29 1,33 1,34 1,35 1,38 1,39 1,43 1,46 1,50 1,52 8.549}
{0 CHEMBL1629865,10 1,11 1,13 1,16 1,17 1,18 1,19 1,21 1,23 1,24 1,25 1,26 1,27 1,28 1,29 1,30 1,31 1,33 1,34 1,35 1,38 1,39 1,43 1,46 1,50 1,52 7.595}
{0 CHEMBL1629866,10 1,11 1,13 1,16 1,17 1,18 1,19 1,21 1,23 1,24 1,25 1,26 1,27 1,28 1,29 1,31 1,33 1,34 1,35 1,38 1,39 1,43 1,46 1,50 1,52 8.16}
{0 CHEMBL1631757,10 1,11 1,12 1,13 1,16 1,17 1,18 1,19 1,21 1,23 1,24 1,25 1,26 1,27 1,28 1,29 1,31 1,33 1,34 1,35 1,39 1,43 1,46 1,50 1,51 1,52 8.174}
{0 CHEMBL1631854,10 1,11 1,13 1,16 1,17 1,18 1,19 1,21 1,23 1,24 1,25 1,26 1,27 1,28 1,29 1,31 1,33 1,34 1,35 1,39 1,42 1,43 1,44 1,45 1,46 1,50 1,51 1,52 7.125}
{0 CHEMBL1631855,10 1,11 1,13 1,16 1,17 1,18 1,19 1,21 1,23 1,24 1,25 1,26 1,27 1,28 1,29 1,30 1,31 1,33 1,34 1,35 1,38 1,39 1,43 1,46 1,50 1,52 6.456}
{0 CHEMBL1631856,2 1,10 1,11 1,13 1,16 1,17 1,18 1,19 1,21 1,23 1,24 1,25 1,26 1,27 1,28 1,29 1,30 1,31 1,33 1,34 1,35 1,38 1,39 1,43 1,46 1,50 1,52 6.721}
{0 CHEMBL1631857,7 1,10 1,11 1,13 1,16 1,17 1,18 1,19 1,21 1,23 1,24 1,25 1,26 1,27 1,28 1,29 1,31 1,33 1,34 1,35 1,38 1,39 1,42 1,43 1,44 1,45 1,46 1,50 1,51 1,52 6.921}
{0 CHEMBL1631858,10 1,11 1,13 1,16 1,17 1,18 1,19 1,21 1,23 1,24 1,25 1,26 1,27 1,28 1,29 1,31 1,33 1,34 1,35 1,38 1,39 1,43 1,46 1,50 1,51 1,52 7.959}
{0 CHEMBL1631859,10 1,11 1,13 1,16 1,17 1,18 1,19 1,21 1,23 1,24 1,25 1,26 1,27 1,28 1,29 1,31 1,33 1,34 1,35 1,38 1,39 1,43 1,46 1,50 1,51 1,52 8.398}
{0 CHEMBL1631860,10 1,11 1,13 1,16 1,17 1,18 1,19 1,21 1,23 1,24 1,25 1,26 1,27 1,28 1,29 1,31 1,33 1,34 1,35 1,38 1,39 1,43 1,46 1,50 1,51 1,52 8.199}
{0 CHEMBL1631861,10 1,11 1,13 1,16 1,17 1,18 1,19 1,21 1,23 1,24 1,25 1,26 1,27 1,28 1,29 1,31 1,33 1,34 1,35 1,38 1,39 1,43 1,46 1,50 1,51 1,52 7.833}
{0 CHEMBL1631862,10 1,11 1,13 1,16 1,17 1,18 1,19 1,21 1,23 1,24 1,25 1,26 1,27 1,28 1,29 1,31 1,33 1,34 1,35 1,38 1,39 1,43 1,46 1,50 1,51 1,52 7.18}
{0 CHEMBL1631863,10 1,11 1,13 1,16 1,17 1,18 1,19 1,21 1,23 1,24 1,25 1,26 1,27 1,28 1,29 1,31 1,33 1,34 1,35 1,38 1,39 1,43 1,46 1,50 1,51 1,52 8.111}
{0 CHEMBL1631864,10 1,11 1,13 1,16 1,17 1,18 1,19 1,21 1,23 1,24 1,25 1,26 1,27 1,28 1,29 1,31 1,33 1,34 1,35 1,38 1,39 1,43 1,46 1,50 1,51 1,52 8.199}
{0 CHEMBL1631865,10 1,11 1,13 1,16 1,17 1,18 1,19 1,21 1,23 1,24 1,25 1,26 1,27 1,28 1,29 1,31 1,33 1,34 1,35 1,38 1,39 1,43 1,46 1,50 1,51 1,52 8.078}
{0 CHEMBL1631866,10 1,11 1,13 1,16 1,17 1,18 1,19 1,21 1,23 1,24 1,25 1,26 1,27 1,28 1,29 1,31 1,33 1,34 1,35 1,38 1,39 1,43 1,46 1,50 1,51 1,52 6.928}
{0 CHEMBL1631867,10 1,11 1,13 1,16 1,17 1,18 1,19 1,21 1,23 1,24 1,25 1,26 1,27 1,28 1,29 1,31 1,33 1,34 1,35 1,38 1,39 1,43 1,46 1,50 1,51 1,52 7.796}
{0 CHEMBL1631868,7 1,10 1,11 1,13 1,16 1,17 1,18 1,19 1,21 1,23 1,24 1,25 1,26 1,27 1,28 1,29 1,31 1,33 1,34 1,35 1,38 1,39 1,43 1,46 1,50 1,51 1,52 7.816}
{0 CHEMBL1631869,10 1,11 1,13 1,16 1,17 1,18 1,19 1,21 1,23 1,24 1,25 1,26 1,27 1,28 1,29 1,31 1,33 1,34 1,35 1,38 1,39 1,43 1,46 1,50 1,51 1,52 7.886}
{0 CHEMBL1631870,7 1,10 1,11 1,13 1,16 1,17 1,18 1,19 1,21 1,23 1,24 1,25 1,26 1,27 1,28 1,29 1,31 1,33 1,34 1,35 1,38 1,39 1,43 1,46 1,50 1,51 1,52 7.626}
{0 CHEMBL1631871,10 1,11 1,13 1,16 1,17 1,18 1,19 1,21 1,23 1,24 1,25 1,26 1,27 1,28 1,29 1,31 1,33 1,34 1,35 1,38 1,39 1,43 1,46 1,50 1,51 1,52 6.562}
{0 CHEMBL1631872,10 1,11 1,13 1,16 1,17 1,18 1,19 1,21 1,23 1,24 1,25 1,26 1,27 1,28 1,29 1,31 1,33 1,34 1,35 1,38 1,39 1,43 1,46 1,50 1,51 1,52 7.841}
{0 CHEMBL1631873,10 1,11 1,13 1,16 1,17 1,18 1,19 1,21 1,23 1,24 1,25 1,26 1,27 1,28 1,29 1,31 1,33 1,34 1,35 1,38 1,39 1,40 1,43 1,46 1,50 1,51 1,52 7.229}
{0 CHEMBL1631874,10 1,11 1,13 1,16 1,17 1,18 1,19 1,21 1,23 1,24 1,25 1,26 1,27 1,28 1,29 1,31 1,33 1,34 1,35 1,38 1,39 1,43 1,46 1,50 1,51 1,52 7.538}
{0 CHEMBL1631875,10 1,11 1,13 1,16 1,17 1,18 1,19 1,21 1,23 1,24 1,25 1,26 1,27 1,28 1,29 1,31 1,33 1,34 1,35 1,38 1,39 1,43 1,46 1,50 1,51 1,52 7.554}
{0 CHEMBL1631876,10 1,11 1,13 1,16 1,17 1,18 1,19 1,21 1,23 1,24 1,25 1,26 1,27 1,28 1,29 1,31 1,33 1,34 1,35 1,38 1,39 1,43 1,46 1,50 1,51 1,52 8.611}
{0 CHEMBL1651207,11 1,13 1,20 1,21 1,26 1,39 1,40 1,43 1,46 1,50 1,52 6.745}
{0 CHEMBL1651208,11 1,13 1,20 1,26 1,30 1,39 1,40 1,41 1,43 1,46 1,50 1,52 7.301}
{0 CHEMBL1651209,11 1,13 1,20 1,26 1,30 1,39 1,40 1,41 1,43 1,46 1,52 7.155}
{0 CHEMBL1651210,11 1,13 1,20 1,26 1,30 1,39 1,40 1,43 1,46 1,52 7.097}
{0 CHEMBL1651211,11 1,13 1,20 1,26 1,30 1,39 1,40 1,41 1,43 1,46 1,50 1,52 7.046}
{0 CHEMBL1651212,11 1,13 1,20 1,26 1,30 1,39 1,40 1,43 1,46 1,52 7}
{0 CHEMBL1651213,11 1,13 1,20 1,26 1,30 1,39 1,40 1,41 1,43 1,46 1,52 6.658}
{0 CHEMBL1651214,11 1,13 1,20 1,26 1,28 1,30 1,39 1,40 1,43 1,46 1,52 6.585}
{0 CHEMBL1651215,11 1,13 1,20 1,26 1,30 1,39 1,40 1,41 1,43 1,46 1,50 1,52 6.569}
{0 CHEMBL1651216,10 1,11 1,13 1,20 1,26 1,30 1,39 1,40 1,43 1,46 1,52 6.456}
{0 CHEMBL1651217,11 1,13 1,20 1,26 1,30 1,39 1,40 1,43 1,46 1,52 7.222}
{0 CHEMBL1651218,11 1,13 1,20 1,26 1,30 1,39 1,40 1,43 1,46 1,52 5}
{0 CHEMBL1651219,11 1,13 1,20 1,26 1,30 1,37 1,39 1,40 1,41 1,43 1,46 1,50 1,52 6.77}
{0 CHEMBL1651220,11 1,13 1,20 1,26 1,30 1,37 1,39 1,40 1,41 1,43 1,46 1,50 1,52 6.509}
{0 CHEMBL1651221,11 1,13 1,20 1,26 1,30 1,39 1,40 1,41 1,43 1,46 1,50 1,52 6.523}
{0 CHEMBL1730632,8 1,11 1,13 1,23 1,25 1,26 1,27 1,28 1,30 1,34 1,38 1,43 1,46 1,49 1,50 1,52 6.104}
{0 CHEMBL1774099,10 1,11 1,13 1,26 1,28 1,30 1,34 1,43 1,46 1,52 6.05}
{0 CHEMBL1774100,26 1,28 1,43 1,46 1,50 1,52 5.32}
{0 CHEMBL1774101,13 1,26 1,30 1,39 1,43 1,46 1,50 1,52 7.06}
{0 CHEMBL1774102,11 1,26 1,39 1,43 1,46 1,50 1,52 5.48}
{0 CHEMBL1774103,11 1,26 1,39 1,43 1,46 1,50 1,52 6.799}
{0 CHEMBL1774104,11 1,26 1,39 1,43 1,46 1,50 1,52 6.842}
{0 CHEMBL1774105,26 1,39 1,43 1,46 1,50 1,52 5.79}
{0 CHEMBL1774106,8 1,23 1,26 1,39 1,43 1,46 1,50 1,52 5}
{0 CHEMBL1774107,11 1,26 1,39 1,43 1,46 1,50 1,52 8.119}
{0 CHEMBL1774108,10 1,11 1,26 1,38 1,39 1,43 1,50 1,52 7.319}
{0 CHEMBL1774109,10 1,11 1,26 1,38 1,39 1,43 1,50 1,52 6.775}
{0 CHEMBL1774110,10 1,11 1,26 1,38 1,39 1,43 1,50 1,52 6.708}
{0 CHEMBL1774111,10 1,11 1,26 1,38 1,39 1,43 1,50 1,52 6.545}
{0 CHEMBL1774112,10 1,11 1,13 1,26 1,38 1,39 1,43 1,50 1,52 7.886}
{0 CHEMBL1774221,10 1,11 1,26 1,38 1,39 1,43 1,50 1,52 7.6}
{0 CHEMBL1774222,10 1,11 1,13 1,26 1,30 1,38 1,39 1,43 1,50 1,52 7.602}
{0 CHEMBL1774223,7 1,10 1,11 1,23 1,26 1,32 1,38 1,39 1,43 1,50 1,52 5}
{0 CHEMBL1774224,10 1,11 1,26 1,38 1,39 1,43 1,50 1,52 6.343}
{0 CHEMBL1774225,10 1,11 1,26 1,38 1,39 1,43 1,50 1,52 6.735}
{0 CHEMBL1774226,10 1,11 1,26 1,28 1,38 1,39 1,43 1,50 1,52 6.128}
{0 CHEMBL1774227,10 1,11 1,26 1,38 1,39 1,43 1,50 1,52 6.955}
{0 CHEMBL1774228,10 1,11 1,26 1,38 1,39 1,43 1,50 1,52 5.701}
{0 CHEMBL1774229,11 1,26 1,38 1,39 1,43 1,50 1,52 7.553}
{0 CHEMBL1774230,11 1,26 1,38 1,39 1,43 1,50 1,52 5.742}
{0 CHEMBL1774231,10 1,11 1,13 1,26 1,38 1,39 1,43 1,50 1,52 7.658}
{0 CHEMBL1774232,10 1,11 1,13 1,26 1,38 1,39 1,43 1,50 1,52 6.104}
{0 CHEMBL1774233,10 1,11 1,26 1,38 1,39 1,43 1,50 1,52 8.046}
{0 CHEMBL1774234,10 1,11 1,26 1,38 1,39 1,43 1,50 1,52 6.003}
{0 CHEMBL1774235,10 1,11 1,13 1,26 1,30 1,38 1,39 1,43 1,50 1,52 7.456}
{0 CHEMBL1774236,10 1,11 1,13 1,26 1,30 1,38 1,39 1,43 1,50 1,52 6.087}
{0 CHEMBL181710,1 1,2 1,3 1,4 1,5 1,6 1,7 1,8 1,9 1,10 1,11 1,12 1,14 1,20 1,23 1,26 1,31 1,39 1,40 1,41 1,43 1,52 8.516}
{0 CHEMBL182899,1 1,2 1,3 1,4 1,5 1,6 1,7 1,8 1,9 1,10 1,11 1,12 1,14 1,20 1,23 1,26 1,31 1,39 1,40 1,41 1,43 1,46 1,52 8.697}
{0 CHEMBL182972,1 1,2 1,3 1,4 1,5 1,6 1,7 1,8 1,9 1,10 1,11 1,12 1,14 1,20 1,23 1,26 1,31 1,39 1,40 1,41 1,43 1,52 8.839}
{0 CHEMBL183073,1 1,2 1,3 1,4 1,5 1,6 1,7 1,8 1,9 1,10 1,11 1,12 1,14 1,20 1,23 1,26 1,31 1,39 1,40 1,41 1,43 1,52 8.236}
{0 CHEMBL183956,1 1,2 1,3 1,4 1,5 1,6 1,7 1,8 1,9 1,10 1,11 1,12 1,14 1,20 1,23 1,31 1,40 1,41 1,52 6.64}
{0 CHEMBL18439,7 1,20 1,23 1,25 1,26 1,27 1,31 1,32 1,39 1,40 1,43 1,47 1,49 1,52 4.959}
{0 CHEMBL184441,1 1,2 1,3 1,4 1,5 1,6 1,7 1,8 1,9 1,10 1,11 1,12 1,14 1,20 1,23 1,31 1,40 1,41 1,52 8.151}
{0 CHEMBL184504,1 1,2 1,3 1,4 1,5 1,6 1,7 1,8 1,9 1,10 1,11 1,12 1,14 1,15 1,20 1,22 1,23 1,26 1,31 1,39 1,40 1,41 1,43 1,46 1,52 8.03}
{0 CHEMBL184983,1 1,2 1,3 1,4 1,5 1,6 1,7 1,8 1,9 1,10 1,11 1,12 1,14 1,20 1,23 1,26 1,31 1,39 1,40 1,41 1,43 1,52 8.793}
{0 CHEMBL185135,1 1,2 1,3 1,4 1,5 1,6 1,7 1,8 1,9 1,10 1,11 1,12 1,14 1,20 1,23 1,31 1,40 1,41 1,52 6.721}
{0 CHEMBL185210,1 1,2 1,3 1,4 1,5 1,6 1,7 1,8 1,9 1,10 1,11 1,12 1,14 1,15 1,20 1,22 1,23 1,26 1,31 1,39 1,40 1,41 1,43 1,46 1,52 7.644}
{0 CHEMBL185335,1 1,2 1,3 1,4 1,5 1,6 1,7 1,8 1,9 1,10 1,11 1,12 1,14 1,15 1,20 1,23 1,26 1,31 1,38 1,40 1,41 1,43 1,50 1,52 8.056}
{0 CHEMBL185423,1 1,2 1,3 1,4 1,5 1,6 1,7 1,8 1,9 1,10 1,11 1,12 1,14 1,20 1,23 1,26 1,31 1,39 1,40 1,41 1,43 1,52 8.506}
{0 CHEMBL185456,1 1,2 1,3 1,4 1,5 1,6 1,7 1,8 1,9 1,10 1,11 1,12 1,14 1,20 1,23 1,26 1,31 1,39 1,40 1,41 1,43 1,52 7.695}
{0 CHEMBL185641,1 1,2 1,3 1,4 1,5 1,6 1,7 1,8 1,9 1,10 1,11 1,12 1,14 1,15 1,20 1,22 1,23 1,26 1,31 1,39 1,40 1,41 1,43 1,52 5}
{0 CHEMBL185822,3 1,4 1,5 1,6 1,7 1,8 1,10 1,11 1,12 1,14 1,20 1,23 1,31 1,32 1,40 1,52 4}
{0 CHEMBL186107,1 1,2 1,3 1,4 1,5 1,6 1,7 1,8 1,9 1,10 1,11 1,12 1,14 1,15 1,20 1,22 1,23 1,26 1,31 1,39 1,40 1,41 1,43 1,46 1,52 8.362}
{0 CHEMBL186145,1 1,2 1,3 1,4 1,5 1,6 1,7 1,8 1,9 1,10 1,11 1,12 1,14 1,20 1,23 1,31 1,40 1,41 1,52 8.175}
{0 CHEMBL186214,1 1,2 1,3 1,4 1,5 1,6 1,7 1,8 1,9 1,10 1,11 1,12 1,14 1,15 1,20 1,22 1,23 1,26 1,31 1,39 1,40 1,41 1,43 1,46 1,52 6.883}
{0 CHEMBL186215,1 1,2 1,3 1,4 1,5 1,6 1,7 1,8 1,9 1,10 1,11 1,12 1,14 1,20 1,23 1,26 1,31 1,39 1,40 1,41 1,43 1,46 1,52 8.007}
{0 CHEMBL186453,1 1,2 1,3 1,4 1,5 1,6 1,7 1,8 1,9 1,10 1,11 1,12 1,14 1,15 1,20 1,22 1,23 1,26 1,31 1,39 1,40 1,41 1,43 1,52 4}
{0 CHEMBL186630,1 1,2 1,3 1,4 1,5 1,6 1,7 1,8 1,9 1,10 1,11 1,12 1,14 1,15 1,20 1,22 1,23 1,26 1,31 1,39 1,40 1,41 1,43 1,52 4}
{0 CHEMBL186891,1 1,2 1,3 1,4 1,5 1,6 1,7 1,8 1,9 1,10 1,11 1,12 1,14 1,15 1,20 1,22 1,23 1,26 1,27 1,31 1,39 1,40 1,41 1,43 1,46 1,52 7.812}
{0 CHEMBL187482,1 1,2 1,3 1,4 1,5 1,6 1,7 1,8 1,9 1,10 1,11 1,12 1,14 1,15 1,20 1,22 1,23 1,26 1,31 1,40 1,41 1,43 1,46 1,52 8.367}
{0 CHEMBL188425,1 1,2 1,3 1,4 1,5 1,6 1,7 1,8 1,9 1,10 1,11 1,12 1,13 1,14 1,15 1,20 1,22 1,23 1,26 1,30 1,31 1,39 1,40 1,41 1,43 1,46 1,52 8.146}
{0 CHEMBL188511,1 1,2 1,3 1,4 1,5 1,6 1,7 1,8 1,9 1,10 1,11 1,12 1,14 1,15 1,20 1,22 1,23 1,26 1,31 1,39 1,40 1,41 1,43 1,52 8.327}
{0 CHEMBL188532,1 1,2 1,3 1,4 1,5 1,6 1,7 1,8 1,9 1,10 1,11 1,12 1,14 1,15 1,20 1,22 1,23 1,26 1,31 1,40 1,41 1,43 1,52 7.907}
{0 CHEMBL188787,1 1,2 1,3 1,4 1,5 1,6 1,7 1,8 1,9 1,10 1,11 1,12 1,14 1,15 1,20 1,22 1,23 1,26 1,31 1,39 1,40 1,41 1,43 1,46 1,52 8.484}
{0 CHEMBL189139,1 1,2 1,3 1,4 1,5 1,6 1,7 1,8 1,9 1,10 1,11 1,12 1,14 1,15 1,20 1,22 1,23 1,26 1,31 1,39 1,40 1,41 1,43 1,52 8.256}
{0 CHEMBL189186,1 1,2 1,3 1,4 1,5 1,6 1,7 1,8 1,9 1,10 1,11 1,12 1,14 1,15 1,20 1,22 1,23 1,26 1,31 1,39 1,40 1,41 1,43 1,46 1,52 8.327}
{0 CHEMBL189710,1 1,2 1,3 1,4 1,5 1,6 1,7 1,8 1,9 1,10 1,11 1,12 1,14 1,15 1,20 1,22 1,23 1,26 1,31 1,39 1,40 1,41 1,43 1,46 1,52 8.243}
{0 CHEMBL189814,1 1,2 1,3 1,4 1,5 1,6 1,7 1,8 1,9 1,10 1,11 1,12 1,14 1,15 1,20 1,22 1,23 1,26 1,31 1,39 1,40 1,41 1,43 1,52 4}
{0 CHEMBL194787,7 1,12 1,14 1,20 1,23 1,31 1,40 1,41 1,52 4.62}
{0 CHEMBL2106523,7 1,12 1,14 1,20 1,23 1,31 1,40 1,52 7.955}
{0 CHEMBL2179625,11 1,13 1,20 1,26 1,30 1,37 1,39 1,40 1,41 1,43 1,46 1,50 1,52 6.194}
{0 CHEMBL2179626,11 1,13 1,20 1,26 1,30 1,37 1,39 1,40 1,41 1,43 1,46 1,50 1,52 5.606}
{0 CHEMBL2179627,11 1,13 1,20 1,26 1,30 1,37 1,39 1,40 1,41 1,43 1,46 1,50 1,52 6.237}
{0 CHEMBL2179628,11 1,13 1,20 1,26 1,30 1,37 1,39 1,40 1,41 1,43 1,46 1,50 1,52 6.328}
{0 CHEMBL2179629,11 1,13 1,20 1,26 1,30 1,37 1,39 1,40 1,41 1,43 1,46 1,50 1,52 6.886}
{0 CHEMBL2179630,11 1,13 1,20 1,26 1,30 1,37 1,39 1,40 1,41 1,43 1,46 1,50 1,52 6.187}
{0 CHEMBL2179631,13 1,20 1,26 1,30 1,39 1,40 1,41 1,43 1,46 1,50 1,52 7.097}
{0 CHEMBL2179632,13 1,20 1,26 1,30 1,39 1,40 1,41 1,43 1,46 1,50 1,52 7.699}
{0 CHEMBL2179633,13 1,20 1,26 1,30 1,39 1,40 1,41 1,43 1,46 1,50 1,52 7.097}
{0 CHEMBL2179634,11 1,13 1,20 1,26 1,30 1,39 1,40 1,41 1,43 1,46 1,50 1,52 7.046}
{0 CHEMBL2179635,11 1,13 1,20 1,26 1,30 1,39 1,40 1,41 1,43 1,46 1,50 1,52 6.959}
{0 CHEMBL2179636,13 1,20 1,21 1,26 1,30 1,39 1,40 1,41 1,43 1,46 1,50 1,52 6.959}
{0 CHEMBL2179637,11 1,13 1,20 1,26 1,30 1,39 1,40 1,41 1,43 1,46 1,50 1,52 6.886}
{0 CHEMBL2179638,13 1,20 1,26 1,30 1,39 1,40 1,41 1,43 1,46 1,50 1,52 6.77}
{0 CHEMBL2179639,13 1,26 1,30 1,39 1,41 1,43 1,46 1,50 1,52 5.301}
{0 CHEMBL2179640,11 1,13 1,26 1,30 1,39 1,41 1,43 1,46 1,50 1,52 5.301}
{0 CHEMBL2179641,10 1,11 1,13 1,26 1,30 1,39 1,41 1,43 1,46 1,50 1,52 5.301}
{0 CHEMBL2179642,13 1,20 1,21 1,26 1,30 1,37 1,39 1,40 1,41 1,43 1,46 1,50 1,52 6.131}
{0 CHEMBL2179643,13 1,20 1,26 1,30 1,37 1,39 1,40 1,41 1,43 1,46 1,50 1,52 6.699}
{0 CHEMBL2179644,11 1,13 1,20 1,26 1,30 1,37 1,39 1,40 1,41 1,43 1,46 1,50 1,52 6.62}
{0 CHEMBL2179645,11 1,13 1,26 1,30 1,37 1,39 1,41 1,43 1,46 1,50 1,52 6.009}
{0 CHEMBL2179646,11 1,20 1,26 1,39 1,40 1,41 1,43 1,46 1,50 1,52 7.699}
{0 CHEMBL235598,13 1,16 1,17 1,18 1,19 1,21 1,23 1,24 1,25 1,26 1,27 1,28 1,29 1,30 1,31 1,33 1,34 1,35 1,39 1,43 1,46 1,52 5.182}
{0 CHEMBL235599,11 1,13 1,16 1,17 1,18 1,19 1,21 1,23 1,24 1,25 1,26 1,27 1,28 1,29 1,30 1,31 1,33 1,34 1,35 1,39 1,43 1,46 1,52 5.55}
{0 CHEMBL235600,13 1,16 1,17 1,18 1,19 1,21 1,23 1,24 1,25 1,26 1,27 1,28 1,29 1,30 1,31 1,33 1,34 1,35 1,39 1,43 1,46 1,52 5.538}
{0 CHEMBL235806,13 1,16 1,17 1,18 1,19 1,21 1,23 1,24 1,25 1,26 1,27 1,28 1,29 1,30 1,31 1,33 1,34 1,35 1,39 1,43 1,46 1,52 7.585}
{0 CHEMBL235807,11 1,13 1,16 1,17 1,18 1,19 1,21 1,23 1,24 1,25 1,26 1,27 1,28 1,29 1,30 1,31 1,33 1,34 1,35 1,39 1,43 1,46 1,52 7.097}
{0 CHEMBL236035,11 1,13 1,16 1,17 1,18 1,19 1,21 1,23 1,24 1,25 1,26 1,27 1,28 1,29 1,30 1,31 1,33 1,34 1,35 1,39 1,43 1,46 1,52 6.812}
{0 CHEMBL236244,7 1,8 1,13 1,16 1,17 1,18 1,19 1,21 1,23 1,24 1,25 1,26 1,27 1,28 1,29 1,30 1,31 1,33 1,34 1,35 1,39 1,43 1,46 1,52 6.446}
{0 CHEMBL236256,13 1,16 1,17 1,18 1,19 1,21 1,23 1,24 1,25 1,26 1,27 1,28 1,29 1,30 1,31 1,33 1,34 1,35 1,38 1,39 1,43 1,46 1,50 1,52 6.523}
{0 CHEMBL236257,13 1,16 1,17 1,18 1,19 1,21 1,23 1,24 1,25 1,26 1,27 1,28 1,29 1,30 1,31 1,33 1,34 1,35 1,38 1,39 1,43 1,46 1,50 1,52 6.06}
{0 CHEMBL236258,7 1,13 1,14 1,16 1,17 1,18 1,19 1,21 1,23 1,24 1,25 1,26 1,27 1,28 1,29 1,30 1,31 1,33 1,34 1,35 1,39 1,43 1,46 1,52 4.585}
{0 CHEMBL236466,13 1,16 1,17 1,18 1,19 1,21 1,23 1,24 1,25 1,26 1,27 1,28 1,29 1,31 1,33 1,34 1,35 1,39 1,43 1,46 1,52 7.222}
{0 CHEMBL236467,13 1,16 1,17 1,18 1,19 1,21 1,23 1,24 1,25 1,26 1,27 1,28 1,29 1,31 1,33 1,34 1,35 1,39 1,43 1,46 1,52 6.423}
{0 CHEMBL236468,13 1,16 1,17 1,18 1,19 1,21 1,23 1,24 1,25 1,26 1,27 1,28 1,29 1,31 1,33 1,34 1,35 1,39 1,43 1,46 1,52 7.398}
{0 CHEMBL236668,13 1,16 1,17 1,18 1,19 1,21 1,23 1,24 1,25 1,26 1,27 1,28 1,29 1,31 1,33 1,34 1,35 1,39 1,43 1,46 1,52 6.351}
{0 CHEMBL236669,13 1,16 1,17 1,18 1,19 1,21 1,23 1,24 1,25 1,26 1,27 1,28 1,29 1,31 1,33 1,34 1,35 1,39 1,43 1,46 1,52 6.796}
{0 CHEMBL236670,13 1,16 1,17 1,18 1,19 1,21 1,23 1,24 1,25 1,26 1,27 1,28 1,29 1,31 1,33 1,34 1,35 1,39 1,43 1,46 1,52 7.036}
{0 CHEMBL236881,13 1,16 1,17 1,18 1,19 1,21 1,23 1,24 1,25 1,26 1,27 1,28 1,29 1,31 1,33 1,34 1,35 1,39 1,43 1,46 1,52 7.553}
{0 CHEMBL236882,13 1,16 1,17 1,18 1,19 1,20 1,21 1,23 1,24 1,25 1,26 1,27 1,28 1,29 1,31 1,33 1,34 1,35 1,39 1,40 1,43 1,46 1,52 6.222}
{0 CHEMBL236883,13 1,14 1,16 1,17 1,18 1,19 1,21 1,23 1,24 1,25 1,26 1,27 1,28 1,29 1,31 1,33 1,34 1,35 1,39 1,42 1,43 1,46 1,52 7.585}
{0 CHEMBL237091,13 1,16 1,17 1,18 1,19 1,21 1,23 1,24 1,25 1,26 1,27 1,28 1,29 1,31 1,33 1,34 1,35 1,39 1,43 1,46 1,52 7.745}
{0 CHEMBL237523,13 1,16 1,17 1,18 1,19 1,21 1,23 1,24 1,25 1,26 1,27 1,28 1,29 1,30 1,31 1,33 1,34 1,35 1,38 1,39 1,43 1,46 1,50 1,52 7.495}
{0 CHEMBL237938,13 1,16 1,17 1,18 1,19 1,21 1,23 1,24 1,25 1,26 1,27 1,28 1,29 1,30 1,31 1,33 1,34 1,35 1,39 1,43 1,46 1,52 6.444}
{0 CHEMBL237944,13 1,16 1,17 1,18 1,19 1,21 1,23 1,24 1,25 1,26 1,27 1,28 1,29 1,30 1,31 1,33 1,34 1,35 1,39 1,43 1,46 1,52 7.167}
{0 CHEMBL238166,11 1,13 1,16 1,17 1,18 1,19 1,21 1,23 1,24 1,25 1,26 1,27 1,28 1,29 1,30 1,31 1,33 1,34 1,35 1,39 1,43 1,46 1,52 7.469}
{0 CHEMBL238167,11 1,13 1,16 1,17 1,18 1,19 1,21 1,23 1,24 1,25 1,26 1,27 1,28 1,29 1,30 1,31 1,33 1,34 1,35 1,39 1,43 1,46 1,52 7.523}
{0 CHEMBL242344,7 1,20 1,23 1,31 1,38 1,40 1,43 1,47 1,48 1,50 1,52 4.498}
{0 CHEMBL255151,7 1,13 1,16 1,17 1,18 1,19 1,21 1,23 1,24 1,25 1,26 1,27 1,28 1,29 1,31 1,33 1,34 1,35 1,38 1,39 1,40 1,42 1,43 1,44 1,45 1,46 1,50 1,52 7.194}
{0 CHEMBL255356,11 1,13 1,16 1,17 1,18 1,19 1,21 1,23 1,24 1,25 1,26 1,27 1,28 1,29 1,30 1,31 1,33 1,34 1,35 1,39 1,42 1,43 1,44 1,45 1,46 1,50 1,52 7.009}
{0 CHEMBL256008,7 1,11 1,13 1,16 1,17 1,18 1,19 1,20 1,21 1,23 1,24 1,25 1,26 1,27 1,28 1,29 1,31 1,33 1,34 1,35 1,38 1,39 1,40 1,42 1,43 1,44 1,45 1,46 1,50 1,52 6.423}
{0 CHEMBL256011,11 1,13 1,16 1,17 1,18 1,19 1,21 1,23 1,24 1,25 1,26 1,27 1,28 1,29 1,30 1,31 1,33 1,34 1,35 1,38 1,39 1,40 1,42 1,43 1,44 1,45 1,46 1,50 1,52 8.046}
{0 CHEMBL256424,7 1,11 1,13 1,16 1,17 1,18 1,19 1,21 1,23 1,24 1,25 1,26 1,27 1,28 1,29 1,31 1,33 1,34 1,35 1,38 1,39 1,40 1,42 1,43 1,44 1,45 1,46 1,50 1,52 6.854}
{0 CHEMBL256812,11 1,13 1,16 1,17 1,18 1,19 1,21 1,23 1,24 1,25 1,26 1,27 1,28 1,29 1,30 1,31 1,33 1,34 1,35 1,38 1,39 1,42 1,43 1,44 1,45 1,46 1,50 1,52 7.921}
{0 CHEMBL258113,13 1,16 1,17 1,18 1,19 1,21 1,23 1,24 1,25 1,26 1,27 1,28 1,29 1,30 1,31 1,33 1,34 1,35 1,38 1,39 1,43 1,46 1,50 1,52 6.137}
{0 CHEMBL259053,10 1,11 1,13 1,16 1,17 1,18 1,19 1,21 1,23 1,24 1,25 1,26 1,27 1,28 1,29 1,31 1,33 1,34 1,35 1,38 1,39 1,42 1,43 1,44 1,45 1,46 1,50 1,52 6.936}
{0 CHEMBL259054,11 1,13 1,16 1,17 1,18 1,19 1,21 1,23 1,24 1,25 1,26 1,27 1,28 1,29 1,30 1,33 1,34 1,35 1,38 1,39 1,40 1,42 1,43 1,44 1,45 1,46 1,50 1,52 7.695}
{0 CHEMBL259269,13 1,16 1,17 1,18 1,19 1,21 1,23 1,24 1,25 1,26 1,27 1,28 1,29 1,30 1,33 1,34 1,35 1,38 1,39 1,40 1,42 1,43 1,44 1,45 1,46 1,50 1,52 7.369}
{0 CHEMBL259340,10 1,11 1,13 1,16 1,17 1,18 1,19 1,21 1,23 1,24 1,25 1,26 1,27 1,28 1,29 1,31 1,33 1,34 1,35 1,38 1,39 1,42 1,43 1,44 1,45 1,46 1,50 1,52 7.335}
{0 CHEMBL259924,10 1,11 1,13 1,16 1,17 1,18 1,19 1,21 1,23 1,24 1,25 1,26 1,27 1,28 1,29 1,31 1,33 1,34 1,35 1,38 1,39 1,42 1,43 1,44 1,45 1,46 1,50 1,52 6.735}
{0 CHEMBL260122,7 1,20 1,23 1,31 1,32 1,35 1,40 1,41 1,52 4.078}
{0 CHEMBL260343,11 1,13 1,16 1,17 1,18 1,19 1,21 1,23 1,24 1,25 1,26 1,27 1,28 1,29 1,30 1,33 1,34 1,35 1,38 1,39 1,42 1,43 1,44 1,45 1,46 1,50 1,52 6.886}
{0 CHEMBL260415,11 1,13 1,16 1,17 1,18 1,19 1,21 1,23 1,24 1,25 1,26 1,27 1,28 1,29 1,30 1,33 1,34 1,35 1,38 1,39 1,40 1,42 1,43 1,44 1,45 1,46 1,50 1,52 7.602}
{0 CHEMBL260455,10 1,11 1,13 1,16 1,17 1,18 1,19 1,21 1,23 1,24 1,25 1,26 1,27 1,28 1,29 1,30 1,31 1,33 1,34 1,35 1,38 1,39 1,42 1,43 1,44 1,45 1,46 1,50 1,52 6.216}
{0 CHEMBL260636,11 1,13 1,16 1,17 1,18 1,19 1,21 1,23 1,24 1,25 1,26 1,27 1,28 1,29 1,30 1,33 1,34 1,35 1,38 1,39 1,40 1,42 1,43 1,44 1,45 1,46 1,50 1,52 7.921}
{0 CHEMBL260642,10 1,11 1,13 1,16 1,17 1,18 1,19 1,21 1,23 1,24 1,25 1,26 1,27 1,28 1,29 1,31 1,33 1,34 1,35 1,38 1,39 1,42 1,43 1,44 1,45 1,46 1,50 1,52 7.907}
{0 CHEMBL260643,10 1,11 1,13 1,16 1,17 1,18 1,19 1,21 1,23 1,24 1,25 1,26 1,27 1,28 1,29 1,31 1,33 1,34 1,35 1,38 1,39 1,42 1,43 1,44 1,45 1,46 1,50 1,52 6.572}
{0 CHEMBL261050,10 1,11 1,13 1,16 1,17 1,18 1,19 1,21 1,23 1,24 1,25 1,26 1,27 1,28 1,29 1,31 1,33 1,34 1,35 1,38 1,39 1,40 1,42 1,43 1,44 1,45 1,46 1,50 1,51 1,52 8.199}
{0 CHEMBL261051,10 1,11 1,13 1,16 1,17 1,18 1,19 1,21 1,23 1,24 1,25 1,26 1,27 1,28 1,29 1,31 1,33 1,34 1,35 1,38 1,39 1,40 1,42 1,43 1,44 1,45 1,46 1,50 1,52 7.797}
{0 CHEMBL261081,11 1,13 1,16 1,17 1,18 1,19 1,21 1,23 1,24 1,25 1,26 1,27 1,28 1,29 1,30 1,33 1,34 1,35 1,38 1,39 1,42 1,43 1,44 1,45 1,46 1,50 1,52 7.758}
{0 CHEMBL261128,10 1,11 1,13 1,16 1,17 1,18 1,19 1,21 1,23 1,24 1,25 1,26 1,27 1,28 1,29 1,30 1,31 1,33 1,34 1,35 1,38 1,39 1,42 1,43 1,44 1,45 1,46 1,50 1,52 7.036}
{0 CHEMBL261251,13 1,16 1,17 1,18 1,19 1,21 1,23 1,24 1,25 1,26 1,27 1,28 1,29 1,30 1,31 1,33 1,34 1,35 1,38 1,39 1,40 1,42 1,43 1,44 1,45 1,46 1,50 1,52 6.678}
{0 CHEMBL261263,10 1,11 1,13 1,16 1,17 1,18 1,19 1,21 1,23 1,24 1,25 1,26 1,27 1,28 1,29 1,31 1,33 1,34 1,35 1,38 1,39 1,40 1,42 1,43 1,44 1,45 1,46 1,50 1,52 7.429}
{0 CHEMBL261288,11 1,13 1,16 1,17 1,18 1,19 1,21 1,23 1,24 1,25 1,26 1,27 1,28 1,29 1,30 1,33 1,34 1,35 1,38 1,39 1,42 1,43 1,44 1,45 1,46 1,50 1,52 7.727}
{0 CHEMBL263312,1 1,2 1,3 1,4 1,5 1,6 1,7 1,8 1,9 1,10 1,11 1,12 1,14 1,20 1,23 1,26 1,31 1,39 1,40 1,41 1,43 1,46 1,52 8.747}
{0 CHEMBL263649,10 1,11 1,13 1,16 1,17 1,18 1,19 1,21 1,23 1,24 1,25 1,26 1,27 1,28 1,29 1,31 1,33 1,34 1,35 1,38 1,39 1,40 1,42 1,43 1,44 1,45 1,46 1,50 1,52 7.284}
{0 CHEMBL263906,10 1,11 1,13 1,16 1,17 1,18 1,19 1,21 1,23 1,24 1,25 1,26 1,27 1,28 1,29 1,30 1,31 1,33 1,34 1,35 1,38 1,39 1,40 1,42 1,43 1,44 1,45 1,46 1,50 1,52 7.367}
{0 CHEMBL270402,13 1,16 1,17 1,18 1,19 1,21 1,23 1,24 1,25 1,26 1,27 1,28 1,29 1,31 1,33 1,34 1,35 1,38 1,39 1,42 1,43 1,44 1,45 1,46 1,50 1,52 7.444}
{0 CHEMBL270616,13 1,16 1,17 1,18 1,19 1,21 1,23 1,24 1,25 1,26 1,27 1,28 1,29 1,31 1,33 1,34 1,35 1,38 1,39 1,40 1,42 1,43 1,44 1,45 1,46 1,50 1,52 7.816}
{0 CHEMBL271319,13 1,16 1,17 1,18 1,19 1,21 1,23 1,24 1,25 1,26 1,27 1,28 1,29 1,30 1,31 1,33 1,34 1,35 1,38 1,39 1,40 1,42 1,43 1,44 1,45 1,46 1,50 1,52 6.77}
{0 CHEMBL277961,7 1,20 1,23 1,24 1,26 1,31 1,39 1,40 1,43 1,47 1,52 4.523}
{0 CHEMBL278949,7 1,13 1,20 1,23 1,24 1,26 1,31 1,39 1,40 1,43 1,52 4.367}
{0 CHEMBL280563,7 1,20 1,23 1,31 1,32 1,40 1,52 6.324}
{0 CHEMBL284193,7 1,20 1,23 1,31 1,32 1,40 1,52 6.523}
{0 CHEMBL288472,11 1,26 1,34 1,37 1,39 1,43 1,46 1,49 1,52 5.097}
{0 CHEMBL288635,7 1,12 1,14 1,20 1,23 1,31 1,40 1,52 4.056}
{0 CHEMBL288902,11 1,13 1,26 1,30 1,34 1,37 1,39 1,43 1,46 1,49 1,52 5.699}
{0 CHEMBL289388,11 1,13 1,26 1,30 1,34 1,37 1,39 1,43 1,46 1,49 1,52 5.398}
{0 CHEMBL289394,11 1,13 1,26 1,30 1,34 1,37 1,39 1,43 1,46 1,49 1,52 5.62}
{0 CHEMBL290416,11 1,13 1,26 1,30 1,34 1,37 1,39 1,43 1,46 1,49 1,52 6}
{0 CHEMBL290509,11 1,13 1,26 1,30 1,34 1,37 1,39 1,43 1,46 1,49 1,52 4.523}
{0 CHEMBL291017,11 1,13 1,26 1,30 1,34 1,37 1,39 1,43 1,46 1,49 1,52 5.398}
{0 CHEMBL297150,7 1,12 1,14 1,20 1,23 1,31 1,40 1,52 5.319}
{0 CHEMBL30285,7 1,20 1,23 1,26 1,31 1,40 1,43 1,47 1,50 1,52 3.97}
{0 CHEMBL303193,11 1,26 1,33 1,41 1,43 1,46 1,50 1,52 6.237}
{0 CHEMBL304285,11 1,26 1,33 1,39 1,41 1,43 1,50 1,52 4.939}
{0 CHEMBL305406,11 1,26 1,33 1,41 1,43 1,46 1,50 1,52 6.63}
{0 CHEMBL305799,11 1,26 1,33 1,39 1,41 1,43 1,50 1,52 5.593}
{0 CHEMBL319279,7 1,9 1,12 1,13 1,14 1,20 1,23 1,26 1,30 1,31 1,39 1,40 1,43 1,46 1,52 5.777}
{0 CHEMBL319732,7 1,9 1,12 1,13 1,14 1,20 1,23 1,26 1,30 1,31 1,39 1,40 1,43 1,46 1,50 1,52 5.728}
{0 CHEMBL322887,7 1,12 1,14 1,20 1,23 1,31 1,40 1,41 1,52 4.796}
{0 CHEMBL333519,3 1,4 1,5 1,6 1,7 1,8 1,10 1,11 1,12 1,14 1,20 1,23 1,31 1,40 1,52 7.648}
{0 CHEMBL334014,7 1,10 1,11 1,12 1,14 1,20 1,23 1,31 1,40 1,46 1,52 7.321}
{0 CHEMBL334160,7 1,20 1,23 1,31 1,32 1,40 1,52 8.097}
{0 CHEMBL334842,7 1,20 1,23 1,31 1,32 1,36 1,40 1,43 1,50 1,52 4.432}
{0 CHEMBL341888,7 1,10 1,11 1,12 1,14 1,20 1,23 1,31 1,40 1,46 1,52 4.384}
{0 CHEMBL343994,7 1,20 1,23 1,31 1,32 1,40 1,52 7}
{0 CHEMBL34453,7 1,12 1,14 1,20 1,23 1,31 1,40 1,52 5.49}
{0 CHEMBL356502,7 1,12 1,14 1,20 1,23 1,28 1,31 1,40 1,52 4}
{0 CHEMBL357043,7 1,20 1,23 1,31 1,32 1,40 1,52 4}
{0 CHEMBL359491,1 1,2 1,3 1,4 1,5 1,6 1,7 1,8 1,9 1,10 1,11 1,12 1,14 1,15 1,20 1,22 1,23 1,26 1,31 1,39 1,40 1,41 1,43 1,52 8.447}
{0 CHEMBL359805,1 1,2 1,3 1,4 1,5 1,6 1,7 1,8 1,9 1,10 1,11 1,12 1,14 1,15 1,20 1,22 1,23 1,26 1,31 1,39 1,40 1,41 1,43 1,46 1,52 8.344}
{0 CHEMBL359905,1 1,2 1,3 1,4 1,5 1,6 1,7 1,8 1,9 1,10 1,11 1,12 1,14 1,15 1,20 1,22 1,23 1,26 1,31 1,40 1,41 1,43 1,52 8.435}
{0 CHEMBL359973,1 1,2 1,3 1,4 1,5 1,6 1,7 1,8 1,9 1,10 1,11 1,12 1,14 1,15 1,20 1,22 1,23 1,26 1,31 1,39 1,40 1,41 1,43 1,52 7.767}
{0 CHEMBL361024,1 1,2 1,3 1,4 1,5 1,6 1,7 1,8 1,9 1,10 1,11 1,12 1,14 1,15 1,20 1,22 1,23 1,26 1,31 1,40 1,41 1,43 1,52 7.928}
{0 CHEMBL361051,1 1,2 1,3 1,4 1,5 1,6 1,7 1,8 1,9 1,10 1,11 1,12 1,14 1,15 1,20 1,22 1,23 1,26 1,31 1,40 1,41 1,43 1,46 1,52 8.154}
{0 CHEMBL362092,1 1,2 1,3 1,4 1,5 1,6 1,7 1,8 1,9 1,10 1,11 1,12 1,14 1,15 1,20 1,22 1,23 1,26 1,31 1,39 1,40 1,41 1,43 1,46 1,52 8.302}
{0 CHEMBL362325,1 1,2 1,3 1,4 1,5 1,6 1,7 1,8 1,9 1,10 1,11 1,12 1,14 1,15 1,20 1,22 1,23 1,26 1,31 1,39 1,40 1,41 1,43 1,52 8.396}
{0 CHEMBL362459,1 1,2 1,3 1,4 1,5 1,6 1,7 1,8 1,9 1,10 1,11 1,12 1,14 1,15 1,20 1,22 1,23 1,31 1,40 1,41 1,43 1,52 8.424}
{0 CHEMBL362708,1 1,2 1,3 1,4 1,5 1,6 1,7 1,8 1,9 1,10 1,11 1,12 1,13 1,14 1,15 1,20 1,22 1,23 1,26 1,30 1,31 1,39 1,40 1,41 1,43 1,46 1,52 8.228}
{0 CHEMBL363034,3 1,4 1,5 1,6 1,7 1,8 1,10 1,11 1,12 1,14 1,20 1,23 1,31 1,32 1,40 1,52 6.979}
{0 CHEMBL363526,1 1,2 1,3 1,4 1,5 1,6 1,7 1,8 1,9 1,10 1,11 1,12 1,14 1,15 1,20 1,22 1,23 1,26 1,31 1,39 1,40 1,41 1,43 1,46 1,52 7.592}
{0 CHEMBL363696,1 1,2 1,3 1,4 1,5 1,6 1,7 1,8 1,9 1,10 1,11 1,12 1,14 1,20 1,23 1,26 1,31 1,39 1,40 1,41 1,43 1,52 8.421}
{0 CHEMBL363724,1 1,2 1,3 1,4 1,5 1,6 1,7 1,8 1,9 1,10 1,11 1,12 1,14 1,20 1,23 1,26 1,31 1,39 1,40 1,41 1,43 1,52 8.583}
{0 CHEMBL363940,1 1,2 1,3 1,4 1,5 1,6 1,7 1,8 1,9 1,10 1,11 1,12 1,14 1,20 1,23 1,31 1,40 1,41 1,50 1,52 8.067}
{0 CHEMBL363980,1 1,2 1,3 1,4 1,5 1,6 1,7 1,8 1,9 1,10 1,11 1,12 1,14 1,15 1,20 1,22 1,23 1,26 1,31 1,40 1,41 1,43 1,52 8.251}
{0 CHEMBL364201,1 1,2 1,3 1,4 1,5 1,6 1,7 1,8 1,9 1,10 1,11 1,12 1,14 1,15 1,20 1,22 1,23 1,26 1,31 1,39 1,40 1,41 1,43 1,46 1,52 8.271}
{0 CHEMBL364320,1 1,2 1,3 1,4 1,5 1,6 1,7 1,8 1,9 1,10 1,11 1,12 1,14 1,15 1,20 1,21 1,22 1,23 1,26 1,31 1,39 1,40 1,41 1,43 1,46 1,52 8.39}
{0 CHEMBL365018,1 1,2 1,3 1,4 1,5 1,6 1,7 1,8 1,9 1,10 1,11 1,12 1,14 1,15 1,20 1,22 1,23 1,26 1,31 1,40 1,41 1,43 1,52 7.842}
{0 CHEMBL365244,1 1,2 1,3 1,4 1,5 1,6 1,7 1,8 1,9 1,10 1,11 1,12 1,14 1,20 1,23 1,26 1,31 1,39 1,40 1,41 1,43 1,52 8.426}
{0 CHEMBL365305,1 1,2 1,3 1,4 1,5 1,6 1,7 1,8 1,9 1,10 1,11 1,12 1,14 1,15 1,20 1,22 1,23 1,26 1,31 1,39 1,40 1,41 1,43 1,46 1,52 8.975}
{0 CHEMBL365647,1 1,2 1,3 1,4 1,5 1,6 1,7 1,8 1,9 1,10 1,11 1,12 1,14 1,15 1,20 1,22 1,23 1,26 1,31 1,39 1,40 1,41 1,43 1,46 1,52 8.532}
{0 CHEMBL365680,1 1,2 1,3 1,4 1,5 1,6 1,7 1,8 1,9 1,10 1,11 1,12 1,14 1,20 1,23 1,26 1,31 1,39 1,40 1,41 1,43 1,52 8.83}
{0 CHEMBL366152,1 1,2 1,3 1,4 1,5 1,6 1,7 1,8 1,9 1,10 1,11 1,12 1,14 1,15 1,20 1,22 1,23 1,26 1,31 1,39 1,40 1,41 1,43 1,46 1,52 8.104}
{0 CHEMBL38533,11 1,13 1,23 1,26 1,29 1,30 1,35 1,37 1,39 1,43 1,46 1,49 1,52 5}
{0 CHEMBL38729,11 1,13 1,26 1,30 1,34 1,37 1,39 1,43 1,46 1,49 1,52 5.824}
{0 CHEMBL389585,7 1,20 1,23 1,31 1,38 1,40 1,43 1,47 1,48 1,50 1,52 4.157}
{0 CHEMBL389980,7 1,11 1,20 1,23 1,31 1,38 1,40 1,41 1,43 1,47 1,48 1,50 1,52 3.82}
{0 CHEMBL390026,7 1,20 1,23 1,26 1,31 1,38 1,40 1,43 1,46 1,47 1,48 1,50 1,52 3.75}
{0 CHEMBL390863,7 1,20 1,23 1,31 1,38 1,40 1,43 1,47 1,48 1,50 1,52 4.247}
{0 CHEMBL392381,13 1,16 1,17 1,18 1,19 1,21 1,23 1,24 1,25 1,26 1,27 1,28 1,29 1,30 1,31 1,33 1,34 1,35 1,39 1,43 1,46 1,52 5.983}
{0 CHEMBL393385,11 1,13 1,16 1,17 1,18 1,19 1,21 1,23 1,24 1,25 1,26 1,27 1,28 1,29 1,30 1,31 1,33 1,34 1,35 1,39 1,43 1,46 1,52 6.319}
{0 CHEMBL394201,13 1,16 1,17 1,18 1,19 1,21 1,23 1,24 1,25 1,26 1,27 1,28 1,29 1,31 1,33 1,34 1,35 1,39 1,43 1,46 1,52 6.556}
{0 CHEMBL394287,13 1,16 1,17 1,18 1,19 1,21 1,23 1,24 1,25 1,26 1,27 1,28 1,29 1,30 1,31 1,33 1,34 1,35 1,39 1,43 1,46 1,52 5.194}
{0 CHEMBL39573,7 1,20 1,23 1,26 1,31 1,32 1,39 1,40 1,43 1,46 1,52 5.004}
{0 CHEMBL396181,10 1,11 1,13 1,16 1,17 1,18 1,19 1,21 1,23 1,24 1,25 1,26 1,27 1,28 1,29 1,30 1,31 1,33 1,34 1,35 1,39 1,43 1,46 1,52 5.815}
{0 CHEMBL398392,13 1,16 1,17 1,18 1,19 1,21 1,23 1,24 1,25 1,26 1,27 1,28 1,29 1,30 1,31 1,33 1,34 1,35 1,39 1,43 1,46 1,52 7.194}
{0 CHEMBL399185,13 1,16 1,17 1,18 1,19 1,21 1,23 1,24 1,25 1,26 1,27 1,28 1,29 1,31 1,33 1,34 1,35 1,39 1,41 1,43 1,46 1,52 7.086}
{0 CHEMBL399186,7 1,13 1,16 1,17 1,18 1,19 1,21 1,23 1,24 1,25 1,26 1,27 1,28 1,29 1,31 1,33 1,34 1,35 1,39 1,42 1,43 1,46 1,52 5.62}
{0 CHEMBL399187,10 1,11 1,13 1,16 1,17 1,18 1,19 1,21 1,23 1,24 1,25 1,26 1,27 1,28 1,29 1,30 1,31 1,33 1,34 1,35 1,39 1,43 1,46 1,52 6.572}
{0 CHEMBL400018,13 1,16 1,17 1,18 1,19 1,21 1,23 1,24 1,25 1,26 1,27 1,28 1,29 1,30 1,31 1,33 1,34 1,35 1,39 1,43 1,46 1,52 6.017}
{0 CHEMBL40086,6 1,7 1,12 1,14 1,20 1,23 1,31 1,32 1,40 1,52 6.523}
{0 CHEMBL401446,13 1,16 1,17 1,18 1,19 1,21 1,23 1,24 1,25 1,26 1,27 1,28 1,29 1,30 1,31 1,33 1,34 1,35 1,39 1,43 1,46 1,52 7.62}
{0 CHEMBL402886,13 1,16 1,17 1,18 1,19 1,21 1,23 1,24 1,25 1,26 1,27 1,28 1,29 1,30 1,31 1,33 1,34 1,35 1,38 1,39 1,40 1,42 1,43 1,44 1,45 1,46 1,50 1,52 7.886}
{0 CHEMBL402963,7 1,11 1,13 1,16 1,17 1,18 1,19 1,21 1,23 1,24 1,25 1,26 1,27 1,28 1,29 1,31 1,33 1,34 1,35 1,38 1,39 1,40 1,42 1,43 1,44 1,45 1,46 1,50 1,52 7.337}
{0 CHEMBL404080,11 1,13 1,16 1,17 1,18 1,19 1,21 1,23 1,24 1,25 1,26 1,27 1,28 1,29 1,30 1,31 1,33 1,34 1,35 1,38 1,39 1,40 1,42 1,43 1,44 1,45 1,46 1,50 1,52 7.748}
{0 CHEMBL404463,13 1,16 1,17 1,18 1,19 1,21 1,23 1,24 1,25 1,26 1,27 1,28 1,29 1,31 1,33 1,34 1,35 1,38 1,39 1,40 1,42 1,43 1,44 1,45 1,46 1,50 1,52 7.731}
{0 CHEMBL404886,11 1,13 1,16 1,17 1,18 1,19 1,20 1,21 1,23 1,24 1,25 1,26 1,27 1,28 1,29 1,31 1,33 1,34 1,35 1,38 1,39 1,40 1,42 1,43 1,44 1,45 1,46 1,50 1,52 7.735}
{0 CHEMBL405895,11 1,13 1,16 1,17 1,18 1,19 1,20 1,21 1,23 1,24 1,25 1,26 1,27 1,28 1,29 1,33 1,34 1,35 1,38 1,39 1,40 1,42 1,43 1,44 1,45 1,46 1,50 1,52 7.557}
{0 CHEMBL406061,11 1,13 1,16 1,17 1,18 1,19 1,21 1,23 1,24 1,25 1,26 1,27 1,28 1,29 1,30 1,33 1,34 1,35 1,38 1,39 1,42 1,43 1,44 1,45 1,46 1,50 1,52 7.222}
{0 CHEMBL408229,10 1,11 1,13 1,16 1,17 1,18 1,19 1,21 1,23 1,24 1,25 1,26 1,27 1,28 1,29 1,31 1,33 1,34 1,35 1,38 1,39 1,42 1,43 1,44 1,45 1,46 1,50 1,51 1,52 7.409}
{0 CHEMBL408455,10 1,11 1,13 1,16 1,17 1,18 1,19 1,21 1,23 1,24 1,25 1,26 1,27 1,28 1,29 1,31 1,33 1,34 1,35 1,38 1,39 1,42 1,43 1,44 1,45 1,46 1,50 1,52 7.469}
{0 CHEMBL408899,7 1,20 1,23 1,31 1,32 1,35 1,40 1,41 1,52 4}
{0 CHEMBL409638,11 1,13 1,16 1,17 1,18 1,19 1,21 1,23 1,24 1,25 1,26 1,27 1,28 1,29 1,30 1,33 1,34 1,35 1,38 1,39 1,42 1,43 1,44 1,45 1,46 1,50 1,52 7.477}
{0 CHEMBL41013,7 1,12 1,14 1,20 1,23 1,31 1,40 1,52 4.114}
{0 CHEMBL411095,10 1,11 1,13 1,16 1,17 1,18 1,19 1,21 1,23 1,24 1,25 1,26 1,27 1,28 1,29 1,31 1,33 1,34 1,35 1,38 1,39 1,40 1,42 1,43 1,44 1,45 1,46 1,50 1,51 1,52 7.821}
{0 CHEMBL411440,11 1,13 1,16 1,17 1,18 1,19 1,20 1,21 1,23 1,24 1,25 1,26 1,27 1,28 1,29 1,31 1,33 1,34 1,35 1,38 1,39 1,40 1,42 1,43 1,44 1,45 1,46 1,50 1,52 7.62}
{0 CHEMBL41242,11 1,13 1,26 1,30 1,34 1,37 1,39 1,43 1,46 1,49 1,52 6}
{0 CHEMBL412445,7 1,12 1,14 1,20 1,23 1,31 1,40 1,52 4.208}
{0 CHEMBL413979,11 1,13 1,16 1,17 1,18 1,19 1,21 1,23 1,24 1,25 1,26 1,27 1,28 1,29 1,30 1,31 1,33 1,34 1,35 1,39 1,43 1,46 1,52 7.119}
{0 CHEMBL41513,11 1,26 1,34 1,37 1,39 1,43 1,46 1,49 1,52 5.699}
{0 CHEMBL41630,11 1,13 1,21 1,26 1,29 1,30 1,34 1,37 1,39 1,43 1,46 1,49 1,52 5}
{0 CHEMBL41808,11 1,13 1,26 1,30 1,34 1,37 1,39 1,41 1,43 1,46 1,49 1,52 5.699}
{0 CHEMBL41932,11 1,26 1,34 1,37 1,39 1,43 1,46 1,49 1,52 5.495}
{0 CHEMBL420262,7 1,9 1,12 1,13 1,14 1,20 1,23 1,26 1,30 1,31 1,39 1,40 1,43 1,46 1,50 1,52 5.666}
{0 CHEMBL426983,1 1,2 1,3 1,4 1,5 1,6 1,7 1,8 1,9 1,10 1,11 1,12 1,14 1,15 1,20 1,22 1,23 1,26 1,31 1,39 1,40 1,41 1,43 1,46 1,52 8.372}
{0 CHEMBL428066,11 1,13 1,16 1,17 1,18 1,19 1,21 1,23 1,24 1,25 1,26 1,27 1,28 1,29 1,30 1,31 1,33 1,34 1,35 1,38 1,39 1,40 1,42 1,43 1,44 1,45 1,46 1,50 1,52 7.009}
{0 CHEMBL429629,13 1,16 1,17 1,18 1,19 1,21 1,23 1,24 1,25 1,26 1,27 1,28 1,29 1,30 1,31 1,33 1,34 1,35 1,39 1,43 1,46 1,52 6.398}
{0 CHEMBL430053,13 1,16 1,17 1,18 1,19 1,21 1,23 1,24 1,25 1,26 1,27 1,28 1,29 1,30 1,31 1,33 1,34 1,35 1,38 1,39 1,42 1,43 1,44 1,45 1,46 1,50 1,52 6.332}
{0 CHEMBL430231,10 1,11 1,13 1,16 1,17 1,18 1,19 1,21 1,23 1,24 1,25 1,26 1,27 1,28 1,29 1,30 1,33 1,34 1,35 1,38 1,39 1,42 1,43 1,44 1,45 1,46 1,50 1,52 7.155}
{0 CHEMBL430408,11 1,13 1,16 1,17 1,18 1,19 1,21 1,23 1,24 1,25 1,26 1,27 1,28 1,29 1,30 1,31 1,33 1,34 1,35 1,39 1,42 1,43 1,44 1,45 1,46 1,50 1,52 7.143}
{0 CHEMBL432038,7 1,9 1,12 1,13 1,14 1,20 1,23 1,26 1,30 1,31 1,39 1,40 1,43 1,46 1,52 4}
{0 CHEMBL434338,1 1,2 1,3 1,4 1,5 1,6 1,7 1,8 1,9 1,10 1,11 1,12 1,14 1,20 1,23 1,31 1,40 1,41 1,52 8.287}
{0 CHEMBL434536,1 1,2 1,3 1,4 1,5 1,6 1,7 1,8 1,9 1,10 1,11 1,12 1,14 1,20 1,23 1,26 1,31 1,39 1,40 1,41 1,43 1,46 1,52 4}
{0 CHEMBL435174,11 1,13 1,26 1,30 1,34 1,37 1,39 1,43 1,46 1,49 1,52 5.523}
{0 CHEMBL437169,7 1,20 1,23 1,26 1,31 1,38 1,39 1,40 1,43 1,46 1,47 1,48 1,50 1,52 4.172}
{0 CHEMBL437646,11 1,13 1,16 1,17 1,18 1,19 1,21 1,23 1,24 1,25 1,26 1,27 1,28 1,29 1,30 1,33 1,34 1,35 1,38 1,39 1,40 1,42 1,43 1,44 1,45 1,46 1,50 1,52 7.143}
{0 CHEMBL437835,11 1,13 1,16 1,17 1,18 1,19 1,21 1,23 1,24 1,25 1,26 1,27 1,28 1,29 1,30 1,33 1,34 1,35 1,38 1,39 1,40 1,42 1,43 1,44 1,45 1,46 1,50 1,52 7.77}
{0 CHEMBL439775,7 1,9 1,12 1,13 1,14 1,20 1,23 1,26 1,30 1,31 1,39 1,40 1,43 1,46 1,52 5.545}
{0 CHEMBL439925,11 1,13 1,26 1,30 1,34 1,37 1,39 1,43 1,46 1,49 1,52 5.398}
{0 CHEMBL442967,1 1,2 1,3 1,4 1,5 1,6 1,7 1,8 1,9 1,10 1,11 1,12 1,14 1,15 1,20 1,22 1,23 1,26 1,31 1,39 1,40 1,41 1,43 1,52 8.41}
{0 CHEMBL444101,7 1,20 1,23 1,26 1,31 1,38 1,39 1,40 1,43 1,46 1,47 1,48 1,50 1,52 3.93}
{0 CHEMBL476551,10 1,11 1,13 1,26 1,30 1,39 1,43 1,46 1,50 1,52 7.071}
{0 CHEMBL476756,13 1,26 1,30 1,38 1,43 1,46 1,50 1,52 5.011}
{0 CHEMBL476790,13 1,26 1,30 1,39 1,43 1,46 1,50 1,52 6.015}
{0 CHEMBL476791,13 1,26 1,30 1,43 1,46 1,50 1,52 6.947}
{0 CHEMBL476965,13 1,26 1,30 1,43 1,46 1,50 1,52 5.52}
{0 CHEMBL476966,11 1,13 1,26 1,30 1,38 1,43 1,46 1,50 1,52 6.292}
{0 CHEMBL476998,11 1,13 1,26 1,43 1,46 1,50 1,52 8.155}
{0 CHEMBL477169,13 1,26 1,30 1,39 1,43 1,46 1,50 1,52 7.585}
{0 CHEMBL477170,11 1,13 1,26 1,30 1,43 1,46 1,50 1,52 7.585}
{0 CHEMBL477375,11 1,13 1,26 1,30 1,43 1,46 1,50 1,52 8.097}
{0 CHEMBL477376,13 1,26 1,30 1,43 1,46 1,50 1,52 7.62}
{0 CHEMBL477377,13 1,26 1,30 1,38 1,43 1,46 1,48 1,50 1,52 5}
{0 CHEMBL478646,10 1,11 1,13 1,26 1,30 1,38 1,39 1,43 1,50 1,52 7.699}
{0 CHEMBL479804,7 1,20 1,23 1,31 1,32 1,35 1,36 1,40 1,52 4}
{0 CHEMBL479805,7 1,20 1,23 1,29 1,31 1,32 1,35 1,36 1,40 1,52 4}
{0 CHEMBL482080,7 1,9 1,20 1,23 1,31 1,32 1,34 1,36 1,40 1,52 4}
{0 CHEMBL483569,10 1,11 1,13 1,26 1,30 1,38 1,39 1,43 1,50 1,52 6.378}
{0 CHEMBL483570,11 1,13 1,26 1,30 1,38 1,43 1,46 1,50 1,52 7.194}
{0 CHEMBL484398,13 1,26 1,30 1,38 1,43 1,46 1,50 1,52 5.674}
{0 CHEMBL484578,11 1,13 1,26 1,30 1,38 1,43 1,46 1,50 1,52 7.066}
{0 CHEMBL500042,7 1,20 1,23 1,31 1,32 1,35 1,36 1,40 1,52 4}
{0 CHEMBL514218,11 1,26 1,38 1,43 1,46 1,50 1,52 7.585}
{0 CHEMBL515034,10 1,11 1,26 1,38 1,39 1,43 1,46 1,50 1,52 7.523}
{0 CHEMBL515794,10 1,13 1,26 1,30 1,43 1,46 1,50 1,52 5}
{0 CHEMBL519817,10 1,11 1,13 1,26 1,30 1,38 1,39 1,43 1,50 1,52 6.6}
{0 CHEMBL538325,7 1,12 1,14 1,19 1,20 1,23 1,31 1,32 1,35 1,40 1,52 5}
{0 CHEMBL538489,7 1,12 1,14 1,20 1,23 1,26 1,31 1,39 1,40 1,43 1,46 1,52 4.292}
{0 CHEMBL539516,7 1,12 1,14 1,20 1,23 1,26 1,31 1,39 1,40 1,43 1,46 1,52 4.347}
{0 CHEMBL539760,7 1,12 1,14 1,20 1,23 1,26 1,31 1,39 1,40 1,43 1,46 1,52 4.347}
{0 CHEMBL539761,7 1,12 1,14 1,20 1,23 1,26 1,31 1,39 1,40 1,43 1,52 5.328}
{0 CHEMBL540015,7 1,12 1,14 1,20 1,23 1,26 1,31 1,39 1,40 1,43 1,46 1,52 5.215}
{0 CHEMBL541050,7 1,12 1,14 1,20 1,23 1,26 1,27 1,31 1,39 1,40 1,43 1,52 5.638}
{0 CHEMBL542862,7 1,12 1,14 1,20 1,23 1,26 1,27 1,31 1,39 1,40 1,43 1,46 1,52 4.456}
{0 CHEMBL543568,7 1,12 1,14 1,20 1,23 1,26 1,31 1,39 1,40 1,43 1,52 4.62}
{0 CHEMBL543811,7 1,12 1,14 1,20 1,23 1,26 1,31 1,38 1,40 1,43 1,46 1,50 1,52 4.432}
{0 CHEMBL544505,7 1,12 1,14 1,20 1,23 1,31 1,40 1,52 6.215}
{0 CHEMBL544508,7 1,12 1,14 1,20 1,23 1,26 1,31 1,39 1,40 1,43 1,46 1,52 5.398}
{0 CHEMBL552836,7 1,12 1,14 1,20 1,23 1,26 1,31 1,39 1,40 1,43 1,46 1,52 4.481}
{0 CHEMBL552984,7 1,11 1,12 1,14 1,20 1,23 1,26 1,31 1,39 1,40 1,43 1,46 1,52 4.114}
{0 CHEMBL556667,8 1,11 1,23 1,25 1,26 1,27 1,38 1,43 1,46 1,49 1,50 1,52 5.833}
{0 CHEMBL562551,8 1,11 1,13 1,23 1,25 1,26 1,27 1,38 1,43 1,46 1,49 1,50 1,52 5.983}
{0 CHEMBL575060,7 1,20 1,23 1,31 1,32 1,36 1,40 1,52 4.928}
{0 CHEMBL593013,13 1,20 1,21 1,26 1,39 1,40 1,43 1,46 1,50 1,52 6.42}
{0 CHEMBL593196,26 1,39 1,43 1,46 1,50 1,52 6.674}
{0 CHEMBL593745,10 1,11 1,26 1,39 1,43 1,46 1,50 1,52 7.108}
{0 CHEMBL604467,10 1,11 1,26 1,39 1,43 1,46 1,50 1,51 1,52 6.963}
{0 CHEMBL607689,11 1,26 1,39 1,43 1,46 1,50 1,52 7.658}
{0 CHEMBL61605,7 1,10 1,11 1,20 1,23 1,31 1,32 1,40 1,52 7.046}
{0 CHEMBL66701,11 1,26 1,39 1,43 1,50 1,52 5.5}
{0 CHEMBL66982,13 1,26 1,30 1,33 1,39 1,41 1,43 1,50 1,52 4}
{0 CHEMBL68739,11 1,26 1,33 1,39 1,41 1,43 1,50 1,52 5.917}
{0 CHEMBL69204,11 1,22 1,26 1,33 1,39 1,43 1,46 1,50 1,52 5.572}
{0 CHEMBL69461,11 1,26 1,33 1,39 1,41 1,43 1,50 1,52 6.328}
{0 CHEMBL69869,11 1,26 1,33 1,39 1,41 1,43 1,50 1,52 4.125}
{0 CHEMBL69970,11 1,26 1,33 1,39 1,41 1,43 1,50 1,52 5.979}
{0 CHEMBL70025,11 1,22 1,26 1,33 1,39 1,43 1,46 1,50 1,52 5.699}
{0 CHEMBL70026,10 1,11 1,26 1,33 1,39 1,41 1,43 1,50 1,52 5.86}
{0 CHEMBL76232,7 1,20 1,23 1,31 1,32 1,36 1,40 1,52 4.796}
{0 CHEMBL8759,7 1,12 1,14 1,20 1,23 1,31 1,40 1,52 7.631}
{0 CHEMBL88804,7 1,20 1,23 1,31 1,32 1,36 1,40 1,50 1,52 4.456}
{0 CHEMBL95868,7 1,9 1,12 1,13 1,14 1,20 1,23 1,26 1,30 1,31 1,39 1,40 1,43 1,46 1,50 1,52 5.879}
{0 CHEMBL97200,7 1,9 1,12 1,13 1,14 1,20 1,23 1,26 1,30 1,31 1,39 1,40 1,43 1,46 1,52 5.863}
{0 CHEMBL99462,7 1,9 1,12 1,13 1,14 1,20 1,23 1,26 1,30 1,31 1,39 1,40 1,43 1,46 1,52 5}
