{
  "data_features": {
    "feature": [
      {
        "data_type": "nominal",
        "index": "0",
        "is_ignore": "false",
        "is_row_identifier": "true",
        "is_target": "false",
        "name": "molecule_id",
        "nominal_value": [
          "CHEMBL10",
          "CHEMBL101253",
          "CHEMBL103667",
          "CHEMBL105442",
          "CHEMBL1173655",
          "CHEMBL119385",
          "CHEMBL1230020",
          "CHEMBL1236107",
          "CHEMBL1240703",
          "CHEMBL1241674",
          "CHEMBL124660",
          "CHEMBL1258633",
          "CHEMBL1258976",
          "CHEMBL1287853",
          "CHEMBL1289926",
          "CHEMBL1336",
          "CHEMBL1421",
          "CHEMBL14762",
          "CHEMBL1614701",
          "CHEMBL162",
          "CHEMBL1721885",
          "CHEMBL1789941",
          "CHEMBL180022",
          "CHEMBL1908391",
          "CHEMBL1908392",
          "CHEMBL1908393",
          "CHEMBL1908394",
          "CHEMBL1908395",
          "CHEMBL1908396",
          "CHEMBL1908397",
          "CHEMBL191003",
          "CHEMBL2070492",
          "CHEMBL2070493",
          "CHEMBL2070494",
          "CHEMBL2070495",
          "CHEMBL2070496",
          "CHEMBL2070497",
          "CHEMBL2070498",
          "CHEMBL2070499",
          "CHEMBL2070500",
          "CHEMBL2070501",
          "CHEMBL2070502",
          "CHEMBL2070503",
          "CHEMBL2070504",
          "CHEMBL2070505",
          "CHEMBL2070611",
          "CHEMBL2070612",
          "CHEMBL2070613",
          "CHEMBL2070614",
          "CHEMBL2070615",
          "CHEMBL2070616",
          "CHEMBL2070617",
          "CHEMBL2070618",
          "CHEMBL2070619",
          "CHEMBL215152",
          "CHEMBL2205766",
          "CHEMBL221959",
          "CHEMBL223360",
          "CHEMBL230011",
          "CHEMBL2309006",
          "CHEMBL2309609",
          "CHEMBL24828",
          "CHEMBL249697",
          "CHEMBL255863",
          "CHEMBL259084",
          "CHEMBL261849",
          "CHEMBL278041",
          "CHEMBL288441",
          "CHEMBL296468",
          "CHEMBL300138",
          "CHEMBL31965",
          "CHEMBL377300",
          "CHEMBL379218",
          "CHEMBL384304",
          "CHEMBL386051",
          "CHEMBL428690",
          "CHEMBL440084",
          "CHEMBL445813",
          "CHEMBL450786",
          "CHEMBL464552",
          "CHEMBL475251",
          "CHEMBL477772",
          "CHEMBL483321",
          "CHEMBL491473",
          "CHEMBL494089",
          "CHEMBL509032",
          "CHEMBL511337",
          "CHEMBL513909",
          "CHEMBL521851",
          "CHEMBL522892",
          "CHEMBL525191",
          "CHEMBL535",
          "CHEMBL553",
          "CHEMBL554",
          "CHEMBL558752",
          "CHEMBL565452",
          "CHEMBL565453",
          "CHEMBL566746",
          "CHEMBL568484",
          "CHEMBL568706",
          "CHEMBL568938",
          "CHEMBL569861",
          "CHEMBL570109",
          "CHEMBL570115",
          "CHEMBL570116",
          "CHEMBL570126",
          "CHEMBL570339",
          "CHEMBL570586",
          "CHEMBL570598",
          "CHEMBL570819",
          "CHEMBL570820",
          "CHEMBL570821",
          "CHEMBL570830",
          "CHEMBL570831",
          "CHEMBL570832",
          "CHEMBL571057",
          "CHEMBL571261",
          "CHEMBL571280",
          "CHEMBL571485",
          "CHEMBL571502",
          "CHEMBL571706",
          "CHEMBL571715",
          "CHEMBL571940",
          "CHEMBL571942",
          "CHEMBL571947",
          "CHEMBL572170",
          "CHEMBL572371",
          "CHEMBL572878",
          "CHEMBL572881",
          "CHEMBL573004",
          "CHEMBL573339",
          "CHEMBL574738",
          "CHEMBL576283",
          "CHEMBL576712",
          "CHEMBL576982",
          "CHEMBL577194",
          "CHEMBL578599",
          "CHEMBL578615",
          "CHEMBL583464",
          "CHEMBL584090",
          "CHEMBL584968",
          "CHEMBL585734",
          "CHEMBL601719",
          "CHEMBL607707",
          "CHEMBL608154",
          "CHEMBL91829",
          "CHEMBL939",
          "CHEMBL941"
        ],
        "number_of_missing_values": "0"
      },
      {
        "data_type": "numeric",
        "index": "1",
        "is_ignore": "false",
        "is_row_identifier": "false",
        "is_target": "false",
        "name": "N.",
        "number_of_missing_values": "0"
      },
      {
        "data_type": "numeric",
        "index": "2",
        "is_ignore": "false",
        "is_row_identifier": "false",
        "is_target": "false",
        "name": "nCsp",
        "number_of_missing_values": "0"
      },
      {
        "data_type": "numeric",
        "index": "3",
        "is_ignore": "false",
        "is_row_identifier": "false",
        "is_target": "false",
        "name": "nTB",
        "number_of_missing_values": "0"
      },
      {
        "data_type": "numeric",
        "index": "4",
        "is_ignore": "false",
        "is_row_identifier": "false",
        "is_target": "false",
        "name": "nN",
        "number_of_missing_values": "0"
      },
      {
        "data_type": "numeric",
        "index": "5",
        "is_ignore": "false",
        "is_row_identifier": "false",
        "is_target": "false",
        "name": "nAB",
        "number_of_missing_values": "0"
      },
      {
        "data_type": "numeric",
        "index": "6",
        "is_ignore": "false",
        "is_row_identifier": "false",
        "is_target": "false",
        "name": "nCsp2",
        "number_of_missing_values": "0"
      },
      {
        "data_type": "numeric",
        "index": "7",
        "is_ignore": "false",
        "is_row_identifier": "false",
        "is_target": "false",
        "name": "nBM",
        "number_of_missing_values": "0"
      },
      {
        "data_type": "numeric",
        "index": "8",
        "is_ignore": "false",
        "is_row_identifier": "false",
        "is_target": "false",
        "name": "AMW",
        "number_of_missing_values": "0"
      },
      {
        "data_type": "numeric",
        "index": "9",
        "is_ignore": "false",
        "is_row_identifier": "false",
        "is_target": "false",
        "name": "C.",
        "number_of_missing_values": "0"
      },
      {
        "data_type": "numeric",
        "index": "10",
        "is_ignore": "false",
        "is_row_identifier": "false",
        "is_target": "false",
        "name": "H.",
        "number_of_missing_values": "0"
      },
      {
        "data_type": "numeric",
        "index": "11",
        "is_ignore": "false",
        "is_row_identifier": "false",
        "is_target": "false",
        "name": "Me",
        "number_of_missing_values": "0"
      },
      {
        "data_type": "numeric",
        "index": "12",
        "is_ignore": "false",
        "is_row_identifier": "false",
        "is_target": "false",
        "name": "Mi",
        "number_of_missing_values": "0"
      },
      {
        "data_type": "numeric",
        "index": "13",
        "is_ignore": "false",
        "is_row_identifier": "false",
        "is_target": "false",
        "name": "Mp",
        "number_of_missing_values": "0"
      },
      {
        "data_type": "numeric",
        "index": "14",
        "is_ignore": "false",
        "is_row_identifier": "false",
        "is_target": "true",
        "name": "pXC50",
        "number_of_missing_values": "0"
      }
    ]
  }
}