{
  "data_features": {
    "feature": [
      {
        "data_type": "nominal",
        "index": "0",
        "is_ignore": "false",
        "is_row_identifier": "true",
        "is_target": "false",
        "name": "molecule_id",
        "nominal_value": [
          "CHEMBL100045",
          "CHEMBL100052",
          "CHEMBL100198",
          "CHEMBL100383",
          "CHEMBL100434",
          "CHEMBL100878",
          "CHEMBL101322",
          "CHEMBL101579",
          "CHEMBL101610",
          "CHEMBL101739",
          "CHEMBL101869",
          "CHEMBL10347",
          "CHEMBL104",
          "CHEMBL1077168",
          "CHEMBL1078750",
          "CHEMBL1078751",
          "CHEMBL1078772",
          "CHEMBL1078773",
          "CHEMBL1078953",
          "CHEMBL1078954",
          "CHEMBL1079065",
          "CHEMBL1079066",
          "CHEMBL1082862",
          "CHEMBL1083181",
          "CHEMBL1083182",
          "CHEMBL1084658",
          "CHEMBL1086156",
          "CHEMBL1087942",
          "CHEMBL1088072",
          "CHEMBL1108",
          "CHEMBL1113",
          "CHEMBL114054",
          "CHEMBL114166",
          "CHEMBL114669",
          "CHEMBL115977",
          "CHEMBL116700",
          "CHEMBL116843",
          "CHEMBL1169493",
          "CHEMBL117094",
          "CHEMBL117248",
          "CHEMBL117381",
          "CHEMBL117482",
          "CHEMBL117581",
          "CHEMBL117914",
          "CHEMBL118055",
          "CHEMBL1182155",
          "CHEMBL11828",
          "CHEMBL1200406",
          "CHEMBL1201203",
          "CHEMBL1201216",
          "CHEMBL1201353",
          "CHEMBL1203846",
          "CHEMBL1203847",
          "CHEMBL1203848",
          "CHEMBL1203849",
          "CHEMBL1203850",
          "CHEMBL1203851",
          "CHEMBL1203855",
          "CHEMBL1203856",
          "CHEMBL12062",
          "CHEMBL12127",
          "CHEMBL12202",
          "CHEMBL122671",
          "CHEMBL123012",
          "CHEMBL123102",
          "CHEMBL123138",
          "CHEMBL123349",
          "CHEMBL123448",
          "CHEMBL12364",
          "CHEMBL1237159",
          "CHEMBL1237160",
          "CHEMBL123769",
          "CHEMBL1241328",
          "CHEMBL1241557",
          "CHEMBL1242352",
          "CHEMBL1242444",
          "CHEMBL1242445",
          "CHEMBL1242541",
          "CHEMBL1242542",
          "CHEMBL1242632",
          "CHEMBL1242633",
          "CHEMBL1242724",
          "CHEMBL1242725",
          "CHEMBL1242818",
          "CHEMBL1242819",
          "CHEMBL1242912",
          "CHEMBL1242923",
          "CHEMBL1242950",
          "CHEMBL12501",
          "CHEMBL12529",
          "CHEMBL125294",
          "CHEMBL125365",
          "CHEMBL1254582",
          "CHEMBL1254659",
          "CHEMBL1254660",
          "CHEMBL1254742",
          "CHEMBL1254743",
          "CHEMBL1254828",
          "CHEMBL1254829",
          "CHEMBL1254914",
          "CHEMBL1254915",
          "CHEMBL1255002",
          "CHEMBL1255003",
          "CHEMBL1255085",
          "CHEMBL1255086",
          "CHEMBL1255837",
          "CHEMBL1256934",
          "CHEMBL1258223",
          "CHEMBL1258452",
          "CHEMBL1258671",
          "CHEMBL125989",
          "CHEMBL12603",
          "CHEMBL1282",
          "CHEMBL1306",
          "CHEMBL132378",
          "CHEMBL134",
          "CHEMBL134428",
          "CHEMBL135973",
          "CHEMBL135974",
          "CHEMBL13647",
          "CHEMBL13735",
          "CHEMBL13754",
          "CHEMBL13789",
          "CHEMBL138109",
          "CHEMBL13852",
          "CHEMBL13856",
          "CHEMBL1385840",
          "CHEMBL139505",
          "CHEMBL140450",
          "CHEMBL141322",
          "CHEMBL141343",
          "CHEMBL141444",
          "CHEMBL141604",
          "CHEMBL141821",
          "CHEMBL141986",
          "CHEMBL14199",
          "CHEMBL142236",
          "CHEMBL142243",
          "CHEMBL142251",
          "CHEMBL142307",
          "CHEMBL142310",
          "CHEMBL142383",
          "CHEMBL142387",
          "CHEMBL142398",
          "CHEMBL142606",
          "CHEMBL142718",
          "CHEMBL142719",
          "CHEMBL142743",
          "CHEMBL142784",
          "CHEMBL142864",
          "CHEMBL142871",
          "CHEMBL142929",
          "CHEMBL142957",
          "CHEMBL142958",
          "CHEMBL142967",
          "CHEMBL142981",
          "CHEMBL143026",
          "CHEMBL143066",
          "CHEMBL143558",
          "CHEMBL143562",
          "CHEMBL143766",
          "CHEMBL143801",
          "CHEMBL143940",
          "CHEMBL143973",
          "CHEMBL144286",
          "CHEMBL144534",
          "CHEMBL144731",
          "CHEMBL144779",
          "CHEMBL144925",
          "CHEMBL144933",
          "CHEMBL144938",
          "CHEMBL144956",
          "CHEMBL144965",
          "CHEMBL144989",
          "CHEMBL145001",
          "CHEMBL145072",
          "CHEMBL145122",
          "CHEMBL145134",
          "CHEMBL145170",
          "CHEMBL145178",
          "CHEMBL145190",
          "CHEMBL145267",
          "CHEMBL145278",
          "CHEMBL145332",
          "CHEMBL145334",
          "CHEMBL145338",
          "CHEMBL145353",
          "CHEMBL145394",
          "CHEMBL145411",
          "CHEMBL145443",
          "CHEMBL145459",
          "CHEMBL145525",
          "CHEMBL145547",
          "CHEMBL145553",
          "CHEMBL145562",
          "CHEMBL145571",
          "CHEMBL145574",
          "CHEMBL145587",
          "CHEMBL145610",
          "CHEMBL145719",
          "CHEMBL145746",
          "CHEMBL145752",
          "CHEMBL145756",
          "CHEMBL145770",
          "CHEMBL145785",
          "CHEMBL145793",
          "CHEMBL145843",
          "CHEMBL145894",
          "CHEMBL146109",
          "CHEMBL146163",
          "CHEMBL146654",
          "CHEMBL1491",
          "CHEMBL152154",
          "CHEMBL152155",
          "CHEMBL15245",
          "CHEMBL152693",
          "CHEMBL152725",
          "CHEMBL1535",
          "CHEMBL154023",
          "CHEMBL154170",
          "CHEMBL154298",
          "CHEMBL154346",
          "CHEMBL155326",
          "CHEMBL155327",
          "CHEMBL156661",
          "CHEMBL156893",
          "CHEMBL156950",
          "CHEMBL157138",
          "CHEMBL1626",
          "CHEMBL1628227",
          "CHEMBL1630938",
          "CHEMBL1630939",
          "CHEMBL1630940",
          "CHEMBL1630941",
          "CHEMBL1630942",
          "CHEMBL1632158",
          "CHEMBL1632174",
          "CHEMBL1651208",
          "CHEMBL1672288",
          "CHEMBL170960",
          "CHEMBL17151",
          "CHEMBL17221",
          "CHEMBL1729",
          "CHEMBL1732",
          "CHEMBL1744263",
          "CHEMBL1744265",
          "CHEMBL1744266",
          "CHEMBL1744267",
          "CHEMBL1744269",
          "CHEMBL1744270",
          "CHEMBL1744271",
          "CHEMBL1744272",
          "CHEMBL1744273",
          "CHEMBL1744274",
          "CHEMBL1744276",
          "CHEMBL1744277",
          "CHEMBL1744278",
          "CHEMBL1744280",
          "CHEMBL1744281",
          "CHEMBL1744286",
          "CHEMBL1744287",
          "CHEMBL1744288",
          "CHEMBL1744289",
          "CHEMBL1744291",
          "CHEMBL1744292",
          "CHEMBL1744294",
          "CHEMBL17491",
          "CHEMBL17492",
          "CHEMBL175934",
          "CHEMBL17657",
          "CHEMBL1774991",
          "CHEMBL1774995",
          "CHEMBL17764",
          "CHEMBL17776",
          "CHEMBL17819",
          "CHEMBL17851",
          "CHEMBL17856",
          "CHEMBL178673",
          "CHEMBL1788145",
          "CHEMBL178923",
          "CHEMBL1789975",
          "CHEMBL1796028",
          "CHEMBL1796029",
          "CHEMBL1796030",
          "CHEMBL1796031",
          "CHEMBL1796032",
          "CHEMBL1796033",
          "CHEMBL1796034",
          "CHEMBL1796035",
          "CHEMBL1796036",
          "CHEMBL1796037",
          "CHEMBL1796038",
          "CHEMBL1796039",
          "CHEMBL1796040",
          "CHEMBL1796041",
          "CHEMBL1796042",
          "CHEMBL1796043",
          "CHEMBL1796044",
          "CHEMBL1796045",
          "CHEMBL1796046",
          "CHEMBL1796047",
          "CHEMBL1796048",
          "CHEMBL1796049",
          "CHEMBL1796050",
          "CHEMBL179743",
          "CHEMBL180561",
          "CHEMBL1806874",
          "CHEMBL18069",
          "CHEMBL180932",
          "CHEMBL18256",
          "CHEMBL18303",
          "CHEMBL18329",
          "CHEMBL18436",
          "CHEMBL1909065",
          "CHEMBL1909072",
          "CHEMBL1910139",
          "CHEMBL1910140",
          "CHEMBL1910141",
          "CHEMBL192099",
          "CHEMBL19215",
          "CHEMBL193620",
          "CHEMBL19376",
          "CHEMBL1944689",
          "CHEMBL1944690",
          "CHEMBL1944691",
          "CHEMBL1944692",
          "CHEMBL1944693",
          "CHEMBL1944694",
          "CHEMBL1944695",
          "CHEMBL1945031",
          "CHEMBL1945032",
          "CHEMBL1945033",
          "CHEMBL1945034",
          "CHEMBL1945035",
          "CHEMBL1945036",
          "CHEMBL1945037",
          "CHEMBL1945038",
          "CHEMBL1945039",
          "CHEMBL1945040",
          "CHEMBL1945041",
          "CHEMBL1945042",
          "CHEMBL1945043",
          "CHEMBL1945044",
          "CHEMBL1945289",
          "CHEMBL1945290",
          "CHEMBL1945291",
          "CHEMBL1945292",
          "CHEMBL1945293",
          "CHEMBL1945294",
          "CHEMBL1945296",
          "CHEMBL1945297",
          "CHEMBL1945298",
          "CHEMBL1945299",
          "CHEMBL1945300",
          "CHEMBL1945503",
          "CHEMBL1945504",
          "CHEMBL1946777",
          "CHEMBL1946778",
          "CHEMBL1946779",
          "CHEMBL1946780",
          "CHEMBL1946781",
          "CHEMBL1946782",
          "CHEMBL1946783",
          "CHEMBL1946784",
          "CHEMBL1946785",
          "CHEMBL1946786",
          "CHEMBL1946787",
          "CHEMBL1946788",
          "CHEMBL1947157",
          "CHEMBL19476",
          "CHEMBL194849",
          "CHEMBL196817",
          "CHEMBL197442",
          "CHEMBL19826",
          "CHEMBL198431",
          "CHEMBL198860",
          "CHEMBL199080",
          "CHEMBL2",
          "CHEMBL200136",
          "CHEMBL200366",
          "CHEMBL200446",
          "CHEMBL200580",
          "CHEMBL200839",
          "CHEMBL2031737",
          "CHEMBL2111563",
          "CHEMBL2112774",
          "CHEMBL2112778",
          "CHEMBL2112779",
          "CHEMBL2112853",
          "CHEMBL2114249",
          "CHEMBL214506",
          "CHEMBL214552",
          "CHEMBL214694",
          "CHEMBL214762",
          "CHEMBL214952",
          "CHEMBL214986",
          "CHEMBL215151",
          "CHEMBL215188",
          "CHEMBL2153551",
          "CHEMBL2153552",
          "CHEMBL2153553",
          "CHEMBL2153554",
          "CHEMBL2153555",
          "CHEMBL2153556",
          "CHEMBL2153557",
          "CHEMBL2153558",
          "CHEMBL2153559",
          "CHEMBL2153560",
          "CHEMBL215421",
          "CHEMBL215857",
          "CHEMBL217143",
          "CHEMBL21731",
          "CHEMBL217469",
          "CHEMBL218079",
          "CHEMBL218732",
          "CHEMBL219718",
          "CHEMBL219719",
          "CHEMBL219916",
          "CHEMBL220221",
          "CHEMBL2203713",
          "CHEMBL220515",
          "CHEMBL220717",
          "CHEMBL220781",
          "CHEMBL222896",
          "CHEMBL223289",
          "CHEMBL223750",
          "CHEMBL228278",
          "CHEMBL228279",
          "CHEMBL228280",
          "CHEMBL228332",
          "CHEMBL228333",
          "CHEMBL228334",
          "CHEMBL228389",
          "CHEMBL228390",
          "CHEMBL228445",
          "CHEMBL228494",
          "CHEMBL228496",
          "CHEMBL228553",
          "CHEMBL228554",
          "CHEMBL228606",
          "CHEMBL228607",
          "CHEMBL228608",
          "CHEMBL228658",
          "CHEMBL228659",
          "CHEMBL229084",
          "CHEMBL229085",
          "CHEMBL2312225",
          "CHEMBL2312226",
          "CHEMBL2312227",
          "CHEMBL2312536",
          "CHEMBL2312537",
          "CHEMBL2312538",
          "CHEMBL232592",
          "CHEMBL232593",
          "CHEMBL232607",
          "CHEMBL232609",
          "CHEMBL232779",
          "CHEMBL232780",
          "CHEMBL233407",
          "CHEMBL233410",
          "CHEMBL233416",
          "CHEMBL233582",
          "CHEMBL233584",
          "CHEMBL233592",
          "CHEMBL233623",
          "CHEMBL233790",
          "CHEMBL233814",
          "CHEMBL233816",
          "CHEMBL233849",
          "CHEMBL234194",
          "CHEMBL234231",
          "CHEMBL234232",
          "CHEMBL234422",
          "CHEMBL234423",
          "CHEMBL234474",
          "CHEMBL234476",
          "CHEMBL234607",
          "CHEMBL234609",
          "CHEMBL234649",
          "CHEMBL234650",
          "CHEMBL234669",
          "CHEMBL234679",
          "CHEMBL234680",
          "CHEMBL234681",
          "CHEMBL234854",
          "CHEMBL234874",
          "CHEMBL236617",
          "CHEMBL236618",
          "CHEMBL236621",
          "CHEMBL236830",
          "CHEMBL236832",
          "CHEMBL238401",
          "CHEMBL238402",
          "CHEMBL239806",
          "CHEMBL242507",
          "CHEMBL242508",
          "CHEMBL242723",
          "CHEMBL242724",
          "CHEMBL242725",
          "CHEMBL242934",
          "CHEMBL243228",
          "CHEMBL243229",
          "CHEMBL243690",
          "CHEMBL243692",
          "CHEMBL243694",
          "CHEMBL243864",
          "CHEMBL243866",
          "CHEMBL24777",
          "CHEMBL24778",
          "CHEMBL24981",
          "CHEMBL25121",
          "CHEMBL25300",
          "CHEMBL25467",
          "CHEMBL25554",
          "CHEMBL255937",
          "CHEMBL255938",
          "CHEMBL256040",
          "CHEMBL256041",
          "CHEMBL256597",
          "CHEMBL256804",
          "CHEMBL256853",
          "CHEMBL256982",
          "CHEMBL256983",
          "CHEMBL256984",
          "CHEMBL257077",
          "CHEMBL257097",
          "CHEMBL257098",
          "CHEMBL257799",
          "CHEMBL257800",
          "CHEMBL257801",
          "CHEMBL257976",
          "CHEMBL257977",
          "CHEMBL257978",
          "CHEMBL258007",
          "CHEMBL258178",
          "CHEMBL260009",
          "CHEMBL260116",
          "CHEMBL260575",
          "CHEMBL260576",
          "CHEMBL260720",
          "CHEMBL260789",
          "CHEMBL261304",
          "CHEMBL262002",
          "CHEMBL262217",
          "CHEMBL267336",
          "CHEMBL268030",
          "CHEMBL268758",
          "CHEMBL27013",
          "CHEMBL270589",
          "CHEMBL271913",
          "CHEMBL272340",
          "CHEMBL273312",
          "CHEMBL273316",
          "CHEMBL274529",
          "CHEMBL274864",
          "CHEMBL275386",
          "CHEMBL275469",
          "CHEMBL275844",
          "CHEMBL275902",
          "CHEMBL276733",
          "CHEMBL276932",
          "CHEMBL277361",
          "CHEMBL277375",
          "CHEMBL278716",
          "CHEMBL278865",
          "CHEMBL27899",
          "CHEMBL279136",
          "CHEMBL279436",
          "CHEMBL279516",
          "CHEMBL282214",
          "CHEMBL284103",
          "CHEMBL284470",
          "CHEMBL286003",
          "CHEMBL286591",
          "CHEMBL287791",
          "CHEMBL288768",
          "CHEMBL288772",
          "CHEMBL289339",
          "CHEMBL289916",
          "CHEMBL290860",
          "CHEMBL291166",
          "CHEMBL291951",
          "CHEMBL292189",
          "CHEMBL292365",
          "CHEMBL292403",
          "CHEMBL293149",
          "CHEMBL293515",
          "CHEMBL295001",
          "CHEMBL295304",
          "CHEMBL295395",
          "CHEMBL29591",
          "CHEMBL296419",
          "CHEMBL296965",
          "CHEMBL297667",
          "CHEMBL298058",
          "CHEMBL298579",
          "CHEMBL298713",
          "CHEMBL298838",
          "CHEMBL299452",
          "CHEMBL299539",
          "CHEMBL299691",
          "CHEMBL299914",
          "CHEMBL299984",
          "CHEMBL30008",
          "CHEMBL300222",
          "CHEMBL300272",
          "CHEMBL300355",
          "CHEMBL300540",
          "CHEMBL300766",
          "CHEMBL300821",
          "CHEMBL301024",
          "CHEMBL301077",
          "CHEMBL301078",
          "CHEMBL301416",
          "CHEMBL301707",
          "CHEMBL301726",
          "CHEMBL302092",
          "CHEMBL302246",
          "CHEMBL302495",
          "CHEMBL302698",
          "CHEMBL302940",
          "CHEMBL302942",
          "CHEMBL303248",
          "CHEMBL303464",
          "CHEMBL303485",
          "CHEMBL303627",
          "CHEMBL303681",
          "CHEMBL304132",
          "CHEMBL304591",
          "CHEMBL304977",
          "CHEMBL305029",
          "CHEMBL305660",
          "CHEMBL306792",
          "CHEMBL308671",
          "CHEMBL309106",
          "CHEMBL309518",
          "CHEMBL309949",
          "CHEMBL309969",
          "CHEMBL310332",
          "CHEMBL310471",
          "CHEMBL310599",
          "CHEMBL310768",
          "CHEMBL310890",
          "CHEMBL311014",
          "CHEMBL311247",
          "CHEMBL311290",
          "CHEMBL311479",
          "CHEMBL311890",
          "CHEMBL312871",
          "CHEMBL313160",
          "CHEMBL313251",
          "CHEMBL31354",
          "CHEMBL313953",
          "CHEMBL313990",
          "CHEMBL31410",
          "CHEMBL314960",
          "CHEMBL315392",
          "CHEMBL315538",
          "CHEMBL315914",
          "CHEMBL316100",
          "CHEMBL316358",
          "CHEMBL316495",
          "CHEMBL318544",
          "CHEMBL319553",
          "CHEMBL319972",
          "CHEMBL320397",
          "CHEMBL320419",
          "CHEMBL320736",
          "CHEMBL320910",
          "CHEMBL322405",
          "CHEMBL322688",
          "CHEMBL323579",
          "CHEMBL324090",
          "CHEMBL325648",
          "CHEMBL325745",
          "CHEMBL326067",
          "CHEMBL326702",
          "CHEMBL326837",
          "CHEMBL327005",
          "CHEMBL327327",
          "CHEMBL327712",
          "CHEMBL327716",
          "CHEMBL327775",
          "CHEMBL327931",
          "CHEMBL328268",
          "CHEMBL328658",
          "CHEMBL328763",
          "CHEMBL329143",
          "CHEMBL329272",
          "CHEMBL329928",
          "CHEMBL330198",
          "CHEMBL330401",
          "CHEMBL337862",
          "CHEMBL338029",
          "CHEMBL338608",
          "CHEMBL341665",
          "CHEMBL341747",
          "CHEMBL341838",
          "CHEMBL341849",
          "CHEMBL342062",
          "CHEMBL342064",
          "CHEMBL342111",
          "CHEMBL342126",
          "CHEMBL342324",
          "CHEMBL342347",
          "CHEMBL342543",
          "CHEMBL342731",
          "CHEMBL344294",
          "CHEMBL344339",
          "CHEMBL344432",
          "CHEMBL344525",
          "CHEMBL344551",
          "CHEMBL344957",
          "CHEMBL346380",
          "CHEMBL346465",
          "CHEMBL347268",
          "CHEMBL347920",
          "CHEMBL349082",
          "CHEMBL350906",
          "CHEMBL351542",
          "CHEMBL351543",
          "CHEMBL352225",
          "CHEMBL355784",
          "CHEMBL356195",
          "CHEMBL356571",
          "CHEMBL356584",
          "CHEMBL356605",
          "CHEMBL356829",
          "CHEMBL356978",
          "CHEMBL357129",
          "CHEMBL357131",
          "CHEMBL357172",
          "CHEMBL357439",
          "CHEMBL357628",
          "CHEMBL357828",
          "CHEMBL357842",
          "CHEMBL358313",
          "CHEMBL358489",
          "CHEMBL358590",
          "CHEMBL358595",
          "CHEMBL358685",
          "CHEMBL358785",
          "CHEMBL358795",
          "CHEMBL358802",
          "CHEMBL359012",
          "CHEMBL359173",
          "CHEMBL359421",
          "CHEMBL359430",
          "CHEMBL359433",
          "CHEMBL362954",
          "CHEMBL36622",
          "CHEMBL37212",
          "CHEMBL37883",
          "CHEMBL37962",
          "CHEMBL382972",
          "CHEMBL383938",
          "CHEMBL385371",
          "CHEMBL386005",
          "CHEMBL387832",
          "CHEMBL387833",
          "CHEMBL388361",
          "CHEMBL388884",
          "CHEMBL388897",
          "CHEMBL389104",
          "CHEMBL389978",
          "CHEMBL390129",
          "CHEMBL390184",
          "CHEMBL390192",
          "CHEMBL390473",
          "CHEMBL391016",
          "CHEMBL391017",
          "CHEMBL391035",
          "CHEMBL391107",
          "CHEMBL391530",
          "CHEMBL392066",
          "CHEMBL392377",
          "CHEMBL393104",
          "CHEMBL393105",
          "CHEMBL393725",
          "CHEMBL394139",
          "CHEMBL395110",
          "CHEMBL399195",
          "CHEMBL402003",
          "CHEMBL402388",
          "CHEMBL40303",
          "CHEMBL40325",
          "CHEMBL403280",
          "CHEMBL404566",
          "CHEMBL40464",
          "CHEMBL405355",
          "CHEMBL406316",
          "CHEMBL406348",
          "CHEMBL40650",
          "CHEMBL407308",
          "CHEMBL411",
          "CHEMBL414185",
          "CHEMBL415",
          "CHEMBL415887",
          "CHEMBL416073",
          "CHEMBL41677",
          "CHEMBL417350",
          "CHEMBL417758",
          "CHEMBL417954",
          "CHEMBL417999",
          "CHEMBL418112",
          "CHEMBL41844",
          "CHEMBL418531",
          "CHEMBL418882",
          "CHEMBL418926",
          "CHEMBL419164",
          "CHEMBL41929",
          "CHEMBL419448",
          "CHEMBL419497",
          "CHEMBL41959",
          "CHEMBL419624",
          "CHEMBL41994",
          "CHEMBL41996",
          "CHEMBL42",
          "CHEMBL420",
          "CHEMBL420060",
          "CHEMBL420184",
          "CHEMBL420205",
          "CHEMBL42053",
          "CHEMBL420578",
          "CHEMBL420683",
          "CHEMBL420959",
          "CHEMBL421011",
          "CHEMBL421297",
          "CHEMBL421324",
          "CHEMBL42156",
          "CHEMBL42220",
          "CHEMBL42231",
          "CHEMBL422477",
          "CHEMBL423018",
          "CHEMBL423294",
          "CHEMBL42335",
          "CHEMBL42361",
          "CHEMBL424494",
          "CHEMBL42472",
          "CHEMBL42514",
          "CHEMBL42558",
          "CHEMBL42640",
          "CHEMBL427552",
          "CHEMBL42763",
          "CHEMBL428197",
          "CHEMBL429",
          "CHEMBL429076",
          "CHEMBL429453",
          "CHEMBL429623",
          "CHEMBL429697",
          "CHEMBL43064",
          "CHEMBL43116",
          "CHEMBL431362",
          "CHEMBL431631",
          "CHEMBL432026",
          "CHEMBL432192",
          "CHEMBL432302",
          "CHEMBL432947",
          "CHEMBL433284",
          "CHEMBL433832",
          "CHEMBL434074",
          "CHEMBL43491",
          "CHEMBL435576",
          "CHEMBL43594",
          "CHEMBL436150",
          "CHEMBL436407",
          "CHEMBL43651",
          "CHEMBL436955",
          "CHEMBL43749",
          "CHEMBL43799",
          "CHEMBL43860",
          "CHEMBL438673",
          "CHEMBL43905",
          "CHEMBL439197",
          "CHEMBL439346",
          "CHEMBL439822",
          "CHEMBL44042",
          "CHEMBL440499",
          "CHEMBL44124",
          "CHEMBL441412",
          "CHEMBL442",
          "CHEMBL442059",
          "CHEMBL44288",
          "CHEMBL44294",
          "CHEMBL44403",
          "CHEMBL444590",
          "CHEMBL44496",
          "CHEMBL445",
          "CHEMBL445577",
          "CHEMBL446180",
          "CHEMBL448147",
          "CHEMBL448620",
          "CHEMBL448802",
          "CHEMBL448908",
          "CHEMBL449057",
          "CHEMBL449279",
          "CHEMBL449284",
          "CHEMBL450018",
          "CHEMBL452437",
          "CHEMBL465599",
          "CHEMBL465963",
          "CHEMBL466012",
          "CHEMBL466046",
          "CHEMBL466296",
          "CHEMBL466634",
          "CHEMBL466635",
          "CHEMBL466869",
          "CHEMBL466875",
          "CHEMBL466876",
          "CHEMBL466914",
          "CHEMBL466915",
          "CHEMBL466916",
          "CHEMBL467094",
          "CHEMBL467259",
          "CHEMBL467495",
          "CHEMBL467916",
          "CHEMBL468711",
          "CHEMBL469127",
          "CHEMBL470432",
          "CHEMBL479",
          "CHEMBL481322",
          "CHEMBL49",
          "CHEMBL49137",
          "CHEMBL492785",
          "CHEMBL492834",
          "CHEMBL492835",
          "CHEMBL493",
          "CHEMBL493041",
          "CHEMBL493042",
          "CHEMBL493043",
          "CHEMBL493091",
          "CHEMBL493283",
          "CHEMBL493284",
          "CHEMBL493285",
          "CHEMBL493486",
          "CHEMBL493661",
          "CHEMBL493697",
          "CHEMBL49395",
          "CHEMBL494908",
          "CHEMBL495289",
          "CHEMBL49851",
          "CHEMBL50081",
          "CHEMBL501404",
          "CHEMBL503269",
          "CHEMBL50490",
          "CHEMBL505414",
          "CHEMBL506744",
          "CHEMBL507755",
          "CHEMBL510023",
          "CHEMBL51019",
          "CHEMBL51074",
          "CHEMBL511211",
          "CHEMBL511411",
          "CHEMBL511577",
          "CHEMBL512062",
          "CHEMBL512289",
          "CHEMBL513691",
          "CHEMBL513871",
          "CHEMBL514874",
          "CHEMBL515170",
          "CHEMBL516",
          "CHEMBL517712",
          "CHEMBL51871",
          "CHEMBL521665",
          "CHEMBL521694",
          "CHEMBL531",
          "CHEMBL534",
          "CHEMBL53675",
          "CHEMBL537403",
          "CHEMBL537428",
          "CHEMBL537651",
          "CHEMBL538397",
          "CHEMBL54",
          "CHEMBL540035",
          "CHEMBL540542",
          "CHEMBL541129",
          "CHEMBL542402",
          "CHEMBL543741",
          "CHEMBL544290",
          "CHEMBL549",
          "CHEMBL549764",
          "CHEMBL55290",
          "CHEMBL553276",
          "CHEMBL554416",
          "CHEMBL555146",
          "CHEMBL55629",
          "CHEMBL556313",
          "CHEMBL55645",
          "CHEMBL558890",
          "CHEMBL56",
          "CHEMBL561851",
          "CHEMBL56248",
          "CHEMBL56331",
          "CHEMBL56375",
          "CHEMBL564",
          "CHEMBL56438",
          "CHEMBL564481",
          "CHEMBL56489",
          "CHEMBL56863",
          "CHEMBL56974",
          "CHEMBL57546",
          "CHEMBL57691",
          "CHEMBL59153",
          "CHEMBL59590",
          "CHEMBL597",
          "CHEMBL60452",
          "CHEMBL611",
          "CHEMBL61643",
          "CHEMBL62045",
          "CHEMBL621",
          "CHEMBL62249",
          "CHEMBL629",
          "CHEMBL643",
          "CHEMBL6437",
          "CHEMBL648",
          "CHEMBL64894",
          "CHEMBL66823",
          "CHEMBL67552",
          "CHEMBL67648",
          "CHEMBL67713",
          "CHEMBL679",
          "CHEMBL67932",
          "CHEMBL68045",
          "CHEMBL68203",
          "CHEMBL68241",
          "CHEMBL68565",
          "CHEMBL68601",
          "CHEMBL68604",
          "CHEMBL68699",
          "CHEMBL68746",
          "CHEMBL68913",
          "CHEMBL69143",
          "CHEMBL69245",
          "CHEMBL69264",
          "CHEMBL69295",
          "CHEMBL69339",
          "CHEMBL69848",
          "CHEMBL70095",
          "CHEMBL70178",
          "CHEMBL70326",
          "CHEMBL70563",
          "CHEMBL70634",
          "CHEMBL70676",
          "CHEMBL70691",
          "CHEMBL70692",
          "CHEMBL707",
          "CHEMBL70740",
          "CHEMBL70751",
          "CHEMBL70892",
          "CHEMBL709",
          "CHEMBL70973",
          "CHEMBL71",
          "CHEMBL71001",
          "CHEMBL71473",
          "CHEMBL71479",
          "CHEMBL715",
          "CHEMBL71580",
          "CHEMBL716",
          "CHEMBL72147",
          "CHEMBL723",
          "CHEMBL72441",
          "CHEMBL726",
          "CHEMBL72724",
          "CHEMBL72753",
          "CHEMBL72768",
          "CHEMBL728",
          "CHEMBL72958",
          "CHEMBL72995",
          "CHEMBL73164",
          "CHEMBL73392",
          "CHEMBL74071",
          "CHEMBL74114",
          "CHEMBL74283",
          "CHEMBL74342",
          "CHEMBL74467",
          "CHEMBL7568",
          "CHEMBL75808",
          "CHEMBL761",
          "CHEMBL762",
          "CHEMBL76643",
          "CHEMBL76867",
          "CHEMBL77618",
          "CHEMBL778",
          "CHEMBL77901",
          "CHEMBL78584",
          "CHEMBL78676",
          "CHEMBL78785",
          "CHEMBL78874",
          "CHEMBL79161",
          "CHEMBL79532",
          "CHEMBL79817",
          "CHEMBL79940",
          "CHEMBL79990",
          "CHEMBL80036",
          "CHEMBL80109",
          "CHEMBL80125",
          "CHEMBL80132",
          "CHEMBL80260",
          "CHEMBL80458",
          "CHEMBL80599",
          "CHEMBL80641",
          "CHEMBL80730",
          "CHEMBL808",
          "CHEMBL81",
          "CHEMBL81006",
          "CHEMBL81093",
          "CHEMBL81173",
          "CHEMBL81486",
          "CHEMBL81661",
          "CHEMBL82056",
          "CHEMBL82267",
          "CHEMBL82480",
          "CHEMBL82877",
          "CHEMBL83",
          "CHEMBL83041",
          "CHEMBL83226",
          "CHEMBL83272",
          "CHEMBL83340",
          "CHEMBL83592",
          "CHEMBL836",
          "CHEMBL83791",
          "CHEMBL8412",
          "CHEMBL844",
          "CHEMBL85",
          "CHEMBL8618",
          "CHEMBL88272",
          "CHEMBL88388",
          "CHEMBL88448",
          "CHEMBL88628",
          "CHEMBL89243",
          "CHEMBL89685",
          "CHEMBL89927",
          "CHEMBL89965",
          "CHEMBL90086",
          "CHEMBL90184",
          "CHEMBL90210",
          "CHEMBL90420",
          "CHEMBL90421",
          "CHEMBL90453",
          "CHEMBL90606",
          "CHEMBL90652",
          "CHEMBL91",
          "CHEMBL91022",
          "CHEMBL91091",
          "CHEMBL91125",
          "CHEMBL91179",
          "CHEMBL91403",
          "CHEMBL91405",
          "CHEMBL91415",
          "CHEMBL91550",
          "CHEMBL91616",
          "CHEMBL91956",
          "CHEMBL92322",
          "CHEMBL92328",
          "CHEMBL926",
          "CHEMBL92951",
          "CHEMBL93523",
          "CHEMBL93623",
          "CHEMBL93693",
          "CHEMBL93843",
          "CHEMBL94167",
          "CHEMBL94188",
          "CHEMBL94259",
          "CHEMBL95191",
          "CHEMBL95245",
          "CHEMBL95253",
          "CHEMBL95263",
          "CHEMBL95290",
          "CHEMBL95333",
          "CHEMBL95398",
          "CHEMBL95434",
          "CHEMBL95523",
          "CHEMBL95548",
          "CHEMBL95565",
          "CHEMBL95578",
          "CHEMBL95736",
          "CHEMBL96467",
          "CHEMBL96988",
          "CHEMBL97044",
          "CHEMBL97859",
          "CHEMBL98016",
          "CHEMBL98038",
          "CHEMBL98063",
          "CHEMBL98167",
          "CHEMBL98168",
          "CHEMBL98241",
          "CHEMBL98243",
          "CHEMBL98430",
          "CHEMBL98769",
          "CHEMBL98921",
          "CHEMBL99362",
          "CHEMBL99559",
          "CHEMBL99614",
          "CHEMBL99864"
        ],
        "number_of_missing_values": "0"
      },
      {
        "data_type": "numeric",
        "index": "1",
        "is_ignore": "false",
        "is_row_identifier": "false",
        "is_target": "false",
        "name": "FCFP4_1024b899",
        "number_of_missing_values": "0"
      },
      {
        "data_type": "numeric",
        "index": "2",
        "is_ignore": "false",
        "is_row_identifier": "false",
        "is_target": "false",
        "name": "FCFP4_1024b376",
        "number_of_missing_values": "0"
      },
      {
        "data_type": "numeric",
        "index": "3",
        "is_ignore": "false",
        "is_row_identifier": "false",
        "is_target": "false",
        "name": "FCFP4_1024b429",
        "number_of_missing_values": "0"
      },
      {
        "data_type": "numeric",
        "index": "4",
        "is_ignore": "false",
        "is_row_identifier": "false",
        "is_target": "false",
        "name": "FCFP4_1024b572",
        "number_of_missing_values": "0"
      },
      {
        "data_type": "numeric",
        "index": "5",
        "is_ignore": "false",
        "is_row_identifier": "false",
        "is_target": "false",
        "name": "FCFP4_1024b128",
        "number_of_missing_values": "0"
      },
      {
        "data_type": "numeric",
        "index": "6",
        "is_ignore": "false",
        "is_row_identifier": "false",
        "is_target": "false",
        "name": "FCFP4_1024b65",
        "number_of_missing_values": "0"
      },
      {
        "data_type": "numeric",
        "index": "7",
        "is_ignore": "false",
        "is_row_identifier": "false",
        "is_target": "false",
        "name": "FCFP4_1024b152",
        "number_of_missing_values": "0"
      },
      {
        "data_type": "numeric",
        "index": "8",
        "is_ignore": "false",
        "is_row_identifier": "false",
        "is_target": "false",
        "name": "FCFP4_1024b918",
        "number_of_missing_values": "0"
      },
      {
        "data_type": "numeric",
        "index": "9",
        "is_ignore": "false",
        "is_row_identifier": "false",
        "is_target": "false",
        "name": "FCFP4_1024b540",
        "number_of_missing_values": "0"
      },
      {
        "data_type": "numeric",
        "index": "10",
        "is_ignore": "false",
        "is_row_identifier": "false",
        "is_target": "false",
        "name": "FCFP4_1024b460",
        "number_of_missing_values": "0"
      },
      {
        "data_type": "numeric",
        "index": "11",
        "is_ignore": "false",
        "is_row_identifier": "false",
        "is_target": "false",
        "name": "FCFP4_1024b208",
        "number_of_missing_values": "0"
      },
      {
        "data_type": "numeric",
        "index": "12",
        "is_ignore": "false",
        "is_row_identifier": "false",
        "is_target": "false",
        "name": "FCFP4_1024b412",
        "number_of_missing_values": "0"
      },
      {
        "data_type": "numeric",
        "index": "13",
        "is_ignore": "false",
        "is_row_identifier": "false",
        "is_target": "false",
        "name": "FCFP4_1024b599",
        "number_of_missing_values": "0"
      },
      {
        "data_type": "numeric",
        "index": "14",
        "is_ignore": "false",
        "is_row_identifier": "false",
        "is_target": "false",
        "name": "FCFP4_1024b630",
        "number_of_missing_values": "0"
      },
      {
        "data_type": "numeric",
        "index": "15",
        "is_ignore": "false",
        "is_row_identifier": "false",
        "is_target": "false",
        "name": "FCFP4_1024b913",
        "number_of_missing_values": "0"
      },
      {
        "data_type": "numeric",
        "index": "16",
        "is_ignore": "false",
        "is_row_identifier": "false",
        "is_target": "false",
        "name": "FCFP4_1024b715",
        "number_of_missing_values": "0"
      },
      {
        "data_type": "numeric",
        "index": "17",
        "is_ignore": "false",
        "is_row_identifier": "false",
        "is_target": "false",
        "name": "FCFP4_1024b453",
        "number_of_missing_values": "0"
      },
      {
        "data_type": "numeric",
        "index": "18",
        "is_ignore": "false",
        "is_row_identifier": "false",
        "is_target": "false",
        "name": "FCFP4_1024b18",
        "number_of_missing_values": "0"
      },
      {
        "data_type": "numeric",
        "index": "19",
        "is_ignore": "false",
        "is_row_identifier": "false",
        "is_target": "false",
        "name": "FCFP4_1024b188",
        "number_of_missing_values": "0"
      },
      {
        "data_type": "numeric",
        "index": "20",
        "is_ignore": "false",
        "is_row_identifier": "false",
        "is_target": "false",
        "name": "FCFP4_1024b122",
        "number_of_missing_values": "0"
      },
      {
        "data_type": "numeric",
        "index": "21",
        "is_ignore": "false",
        "is_row_identifier": "false",
        "is_target": "false",
        "name": "FCFP4_1024b256",
        "number_of_missing_values": "0"
      },
      {
        "data_type": "numeric",
        "index": "22",
        "is_ignore": "false",
        "is_row_identifier": "false",
        "is_target": "false",
        "name": "FCFP4_1024b861",
        "number_of_missing_values": "0"
      },
      {
        "data_type": "numeric",
        "index": "23",
        "is_ignore": "false",
        "is_row_identifier": "false",
        "is_target": "false",
        "name": "FCFP4_1024b644",
        "number_of_missing_values": "0"
      },
      {
        "data_type": "numeric",
        "index": "24",
        "is_ignore": "false",
        "is_row_identifier": "false",
        "is_target": "false",
        "name": "FCFP4_1024b670",
        "number_of_missing_values": "0"
      },
      {
        "data_type": "numeric",
        "index": "25",
        "is_ignore": "false",
        "is_row_identifier": "false",
        "is_target": "false",
        "name": "FCFP4_1024b444",
        "number_of_missing_values": "0"
      },
      {
        "data_type": "numeric",
        "index": "26",
        "is_ignore": "false",
        "is_row_identifier": "false",
        "is_target": "false",
        "name": "FCFP4_1024b37",
        "number_of_missing_values": "0"
      },
      {
        "data_type": "numeric",
        "index": "27",
        "is_ignore": "false",
        "is_row_identifier": "false",
        "is_target": "false",
        "name": "FCFP4_1024b10",
        "number_of_missing_values": "0"
      },
      {
        "data_type": "numeric",
        "index": "28",
        "is_ignore": "false",
        "is_row_identifier": "false",
        "is_target": "false",
        "name": "FCFP4_1024b165",
        "number_of_missing_values": "0"
      },
      {
        "data_type": "numeric",
        "index": "29",
        "is_ignore": "false",
        "is_row_identifier": "false",
        "is_target": "false",
        "name": "FCFP4_1024b521",
        "number_of_missing_values": "0"
      },
      {
        "data_type": "numeric",
        "index": "30",
        "is_ignore": "false",
        "is_row_identifier": "false",
        "is_target": "false",
        "name": "FCFP4_1024b325",
        "number_of_missing_values": "0"
      },
      {
        "data_type": "numeric",
        "index": "31",
        "is_ignore": "false",
        "is_row_identifier": "false",
        "is_target": "false",
        "name": "FCFP4_1024b961",
        "number_of_missing_values": "0"
      },
      {
        "data_type": "numeric",
        "index": "32",
        "is_ignore": "false",
        "is_row_identifier": "false",
        "is_target": "false",
        "name": "FCFP4_1024b346",
        "number_of_missing_values": "0"
      },
      {
        "data_type": "numeric",
        "index": "33",
        "is_ignore": "false",
        "is_row_identifier": "false",
        "is_target": "false",
        "name": "FCFP4_1024b370",
        "number_of_missing_values": "0"
      },
      {
        "data_type": "numeric",
        "index": "34",
        "is_ignore": "false",
        "is_row_identifier": "false",
        "is_target": "false",
        "name": "FCFP4_1024b178",
        "number_of_missing_values": "0"
      },
      {
        "data_type": "numeric",
        "index": "35",
        "is_ignore": "false",
        "is_row_identifier": "false",
        "is_target": "false",
        "name": "FCFP4_1024b91",
        "number_of_missing_values": "0"
      },
      {
        "data_type": "numeric",
        "index": "36",
        "is_ignore": "false",
        "is_row_identifier": "false",
        "is_target": "false",
        "name": "FCFP4_1024b697",
        "number_of_missing_values": "0"
      },
      {
        "data_type": "numeric",
        "index": "37",
        "is_ignore": "false",
        "is_row_identifier": "false",
        "is_target": "false",
        "name": "FCFP4_1024b669",
        "number_of_missing_values": "0"
      },
      {
        "data_type": "numeric",
        "index": "38",
        "is_ignore": "false",
        "is_row_identifier": "false",
        "is_target": "false",
        "name": "FCFP4_1024b524",
        "number_of_missing_values": "0"
      },
      {
        "data_type": "numeric",
        "index": "39",
        "is_ignore": "false",
        "is_row_identifier": "false",
        "is_target": "false",
        "name": "FCFP4_1024b357",
        "number_of_missing_values": "0"
      },
      {
        "data_type": "numeric",
        "index": "40",
        "is_ignore": "false",
        "is_row_identifier": "false",
        "is_target": "false",
        "name": "FCFP4_1024b382",
        "number_of_missing_values": "0"
      },
      {
        "data_type": "numeric",
        "index": "41",
        "is_ignore": "false",
        "is_row_identifier": "false",
        "is_target": "false",
        "name": "FCFP4_1024b942",
        "number_of_missing_values": "0"
      },
      {
        "data_type": "numeric",
        "index": "42",
        "is_ignore": "false",
        "is_row_identifier": "false",
        "is_target": "false",
        "name": "FCFP4_1024b389",
        "number_of_missing_values": "0"
      },
      {
        "data_type": "numeric",
        "index": "43",
        "is_ignore": "false",
        "is_row_identifier": "false",
        "is_target": "false",
        "name": "FCFP4_1024b971",
        "number_of_missing_values": "0"
      },
      {
        "data_type": "numeric",
        "index": "44",
        "is_ignore": "false",
        "is_row_identifier": "false",
        "is_target": "false",
        "name": "FCFP4_1024b626",
        "number_of_missing_values": "0"
      },
      {
        "data_type": "numeric",
        "index": "45",
        "is_ignore": "false",
        "is_row_identifier": "false",
        "is_target": "false",
        "name": "FCFP4_1024b54",
        "number_of_missing_values": "0"
      },
      {
        "data_type": "numeric",
        "index": "46",
        "is_ignore": "false",
        "is_row_identifier": "false",
        "is_target": "false",
        "name": "FCFP4_1024b28",
        "number_of_missing_values": "0"
      },
      {
        "data_type": "numeric",
        "index": "47",
        "is_ignore": "false",
        "is_row_identifier": "false",
        "is_target": "false",
        "name": "FCFP4_1024b297",
        "number_of_missing_values": "0"
      },
      {
        "data_type": "numeric",
        "index": "48",
        "is_ignore": "false",
        "is_row_identifier": "false",
        "is_target": "false",
        "name": "FCFP4_1024b456",
        "number_of_missing_values": "0"
      },
      {
        "data_type": "numeric",
        "index": "49",
        "is_ignore": "false",
        "is_row_identifier": "false",
        "is_target": "false",
        "name": "FCFP4_1024b553",
        "number_of_missing_values": "0"
      },
      {
        "data_type": "numeric",
        "index": "50",
        "is_ignore": "false",
        "is_row_identifier": "false",
        "is_target": "false",
        "name": "FCFP4_1024b702",
        "number_of_missing_values": "0"
      },
      {
        "data_type": "numeric",
        "index": "51",
        "is_ignore": "false",
        "is_row_identifier": "false",
        "is_target": "false",
        "name": "FCFP4_1024b728",
        "number_of_missing_values": "0"
      },
      {
        "data_type": "numeric",
        "index": "52",
        "is_ignore": "false",
        "is_row_identifier": "false",
        "is_target": "false",
        "name": "FCFP4_1024b107",
        "number_of_missing_values": "0"
      },
      {
        "data_type": "numeric",
        "index": "53",
        "is_ignore": "false",
        "is_row_identifier": "false",
        "is_target": "false",
        "name": "FCFP4_1024b20",
        "number_of_missing_values": "0"
      },
      {
        "data_type": "numeric",
        "index": "54",
        "is_ignore": "false",
        "is_row_identifier": "false",
        "is_target": "false",
        "name": "FCFP4_1024b787",
        "number_of_missing_values": "0"
      },
      {
        "data_type": "numeric",
        "index": "55",
        "is_ignore": "false",
        "is_row_identifier": "false",
        "is_target": "false",
        "name": "FCFP4_1024b1019",
        "number_of_missing_values": "0"
      },
      {
        "data_type": "numeric",
        "index": "56",
        "is_ignore": "false",
        "is_row_identifier": "false",
        "is_target": "false",
        "name": "FCFP4_1024b940",
        "number_of_missing_values": "0"
      },
      {
        "data_type": "numeric",
        "index": "57",
        "is_ignore": "false",
        "is_row_identifier": "false",
        "is_target": "false",
        "name": "FCFP4_1024b327",
        "number_of_missing_values": "0"
      },
      {
        "data_type": "numeric",
        "index": "58",
        "is_ignore": "false",
        "is_row_identifier": "false",
        "is_target": "false",
        "name": "FCFP4_1024b304",
        "number_of_missing_values": "0"
      },
      {
        "data_type": "numeric",
        "index": "59",
        "is_ignore": "false",
        "is_row_identifier": "false",
        "is_target": "false",
        "name": "FCFP4_1024b318",
        "number_of_missing_values": "0"
      },
      {
        "data_type": "numeric",
        "index": "60",
        "is_ignore": "false",
        "is_row_identifier": "false",
        "is_target": "false",
        "name": "FCFP4_1024b247",
        "number_of_missing_values": "0"
      },
      {
        "data_type": "numeric",
        "index": "61",
        "is_ignore": "false",
        "is_row_identifier": "false",
        "is_target": "false",
        "name": "FCFP4_1024b855",
        "number_of_missing_values": "0"
      },
      {
        "data_type": "numeric",
        "index": "62",
        "is_ignore": "false",
        "is_row_identifier": "false",
        "is_target": "false",
        "name": "FCFP4_1024b427",
        "number_of_missing_values": "0"
      },
      {
        "data_type": "numeric",
        "index": "63",
        "is_ignore": "false",
        "is_row_identifier": "false",
        "is_target": "false",
        "name": "FCFP4_1024b380",
        "number_of_missing_values": "0"
      },
      {
        "data_type": "numeric",
        "index": "64",
        "is_ignore": "false",
        "is_row_identifier": "false",
        "is_target": "false",
        "name": "FCFP4_1024b330",
        "number_of_missing_values": "0"
      },
      {
        "data_type": "numeric",
        "index": "65",
        "is_ignore": "false",
        "is_row_identifier": "false",
        "is_target": "false",
        "name": "FCFP4_1024b309",
        "number_of_missing_values": "0"
      },
      {
        "data_type": "numeric",
        "index": "66",
        "is_ignore": "false",
        "is_row_identifier": "false",
        "is_target": "false",
        "name": "FCFP4_1024b714",
        "number_of_missing_values": "0"
      },
      {
        "data_type": "numeric",
        "index": "67",
        "is_ignore": "false",
        "is_row_identifier": "false",
        "is_target": "false",
        "name": "FCFP4_1024b925",
        "number_of_missing_values": "0"
      },
      {
        "data_type": "numeric",
        "index": "68",
        "is_ignore": "false",
        "is_row_identifier": "false",
        "is_target": "false",
        "name": "FCFP4_1024b32",
        "number_of_missing_values": "0"
      },
      {
        "data_type": "numeric",
        "index": "69",
        "is_ignore": "false",
        "is_row_identifier": "false",
        "is_target": "false",
        "name": "FCFP4_1024b583",
        "number_of_missing_values": "0"
      },
      {
        "data_type": "numeric",
        "index": "70",
        "is_ignore": "false",
        "is_row_identifier": "false",
        "is_target": "false",
        "name": "FCFP4_1024b257",
        "number_of_missing_values": "0"
      },
      {
        "data_type": "numeric",
        "index": "71",
        "is_ignore": "false",
        "is_row_identifier": "false",
        "is_target": "false",
        "name": "FCFP4_1024b783",
        "number_of_missing_values": "0"
      },
      {
        "data_type": "numeric",
        "index": "72",
        "is_ignore": "false",
        "is_row_identifier": "false",
        "is_target": "false",
        "name": "FCFP4_1024b804",
        "number_of_missing_values": "0"
      },
      {
        "data_type": "numeric",
        "index": "73",
        "is_ignore": "false",
        "is_row_identifier": "false",
        "is_target": "false",
        "name": "FCFP4_1024b635",
        "number_of_missing_values": "0"
      },
      {
        "data_type": "numeric",
        "index": "74",
        "is_ignore": "false",
        "is_row_identifier": "false",
        "is_target": "false",
        "name": "FCFP4_1024b975",
        "number_of_missing_values": "0"
      },
      {
        "data_type": "numeric",
        "index": "75",
        "is_ignore": "false",
        "is_row_identifier": "false",
        "is_target": "false",
        "name": "FCFP4_1024b825",
        "number_of_missing_values": "0"
      },
      {
        "data_type": "numeric",
        "index": "76",
        "is_ignore": "false",
        "is_row_identifier": "false",
        "is_target": "false",
        "name": "FCFP4_1024b596",
        "number_of_missing_values": "0"
      },
      {
        "data_type": "numeric",
        "index": "77",
        "is_ignore": "false",
        "is_row_identifier": "false",
        "is_target": "false",
        "name": "FCFP4_1024b133",
        "number_of_missing_values": "0"
      },
      {
        "data_type": "numeric",
        "index": "78",
        "is_ignore": "false",
        "is_row_identifier": "false",
        "is_target": "false",
        "name": "FCFP4_1024b365",
        "number_of_missing_values": "0"
      },
      {
        "data_type": "numeric",
        "index": "79",
        "is_ignore": "false",
        "is_row_identifier": "false",
        "is_target": "false",
        "name": "FCFP4_1024b375",
        "number_of_missing_values": "0"
      },
      {
        "data_type": "numeric",
        "index": "80",
        "is_ignore": "false",
        "is_row_identifier": "false",
        "is_target": "false",
        "name": "FCFP4_1024b921",
        "number_of_missing_values": "0"
      },
      {
        "data_type": "numeric",
        "index": "81",
        "is_ignore": "false",
        "is_row_identifier": "false",
        "is_target": "false",
        "name": "FCFP4_1024b954",
        "number_of_missing_values": "0"
      },
      {
        "data_type": "numeric",
        "index": "82",
        "is_ignore": "false",
        "is_row_identifier": "false",
        "is_target": "false",
        "name": "FCFP4_1024b157",
        "number_of_missing_values": "0"
      },
      {
        "data_type": "numeric",
        "index": "83",
        "is_ignore": "false",
        "is_row_identifier": "false",
        "is_target": "false",
        "name": "FCFP4_1024b29",
        "number_of_missing_values": "0"
      },
      {
        "data_type": "numeric",
        "index": "84",
        "is_ignore": "false",
        "is_row_identifier": "false",
        "is_target": "false",
        "name": "FCFP4_1024b42",
        "number_of_missing_values": "0"
      },
      {
        "data_type": "numeric",
        "index": "85",
        "is_ignore": "false",
        "is_row_identifier": "false",
        "is_target": "false",
        "name": "FCFP4_1024b204",
        "number_of_missing_values": "0"
      },
      {
        "data_type": "numeric",
        "index": "86",
        "is_ignore": "false",
        "is_row_identifier": "false",
        "is_target": "false",
        "name": "FCFP4_1024b248",
        "number_of_missing_values": "0"
      },
      {
        "data_type": "numeric",
        "index": "87",
        "is_ignore": "false",
        "is_row_identifier": "false",
        "is_target": "false",
        "name": "FCFP4_1024b323",
        "number_of_missing_values": "0"
      },
      {
        "data_type": "numeric",
        "index": "88",
        "is_ignore": "false",
        "is_row_identifier": "false",
        "is_target": "false",
        "name": "FCFP4_1024b301",
        "number_of_missing_values": "0"
      },
      {
        "data_type": "numeric",
        "index": "89",
        "is_ignore": "false",
        "is_row_identifier": "false",
        "is_target": "false",
        "name": "FCFP4_1024b269",
        "number_of_missing_values": "0"
      },
      {
        "data_type": "numeric",
        "index": "90",
        "is_ignore": "false",
        "is_row_identifier": "false",
        "is_target": "false",
        "name": "FCFP4_1024b795",
        "number_of_missing_values": "0"
      },
      {
        "data_type": "numeric",
        "index": "91",
        "is_ignore": "false",
        "is_row_identifier": "false",
        "is_target": "false",
        "name": "FCFP4_1024b326",
        "number_of_missing_values": "0"
      },
      {
        "data_type": "numeric",
        "index": "92",
        "is_ignore": "false",
        "is_row_identifier": "false",
        "is_target": "false",
        "name": "FCFP4_1024b793",
        "number_of_missing_values": "0"
      },
      {
        "data_type": "numeric",
        "index": "93",
        "is_ignore": "false",
        "is_row_identifier": "false",
        "is_target": "false",
        "name": "FCFP4_1024b731",
        "number_of_missing_values": "0"
      },
      {
        "data_type": "numeric",
        "index": "94",
        "is_ignore": "false",
        "is_row_identifier": "false",
        "is_target": "false",
        "name": "FCFP4_1024b417",
        "number_of_missing_values": "0"
      },
      {
        "data_type": "numeric",
        "index": "95",
        "is_ignore": "false",
        "is_row_identifier": "false",
        "is_target": "false",
        "name": "FCFP4_1024b904",
        "number_of_missing_values": "0"
      },
      {
        "data_type": "numeric",
        "index": "96",
        "is_ignore": "false",
        "is_row_identifier": "false",
        "is_target": "false",
        "name": "FCFP4_1024b409",
        "number_of_missing_values": "0"
      },
      {
        "data_type": "numeric",
        "index": "97",
        "is_ignore": "false",
        "is_row_identifier": "false",
        "is_target": "false",
        "name": "FCFP4_1024b227",
        "number_of_missing_values": "0"
      },
      {
        "data_type": "numeric",
        "index": "98",
        "is_ignore": "false",
        "is_row_identifier": "false",
        "is_target": "false",
        "name": "FCFP4_1024b606",
        "number_of_missing_values": "0"
      },
      {
        "data_type": "numeric",
        "index": "99",
        "is_ignore": "false",
        "is_row_identifier": "false",
        "is_target": "false",
        "name": "FCFP4_1024b944",
        "number_of_missing_values": "0"
      },
      {
        "data_type": "numeric",
        "index": "100",
        "is_ignore": "false",
        "is_row_identifier": "false",
        "is_target": "false",
        "name": "FCFP4_1024b661",
        "number_of_missing_values": "0"
      },
      {
        "data_type": "numeric",
        "index": "101",
        "is_ignore": "false",
        "is_row_identifier": "false",
        "is_target": "false",
        "name": "FCFP4_1024b957",
        "number_of_missing_values": "0"
      },
      {
        "data_type": "numeric",
        "index": "102",
        "is_ignore": "false",
        "is_row_identifier": "false",
        "is_target": "false",
        "name": "FCFP4_1024b870",
        "number_of_missing_values": "0"
      },
      {
        "data_type": "numeric",
        "index": "103",
        "is_ignore": "false",
        "is_row_identifier": "false",
        "is_target": "true",
        "name": "pXC50",
        "number_of_missing_values": "0"
      }
    ]
  }
}