"molecule_id","N.","O.","nHet","nO","Me","SCBO","pXC50"
{1 3.8,2 3.8,3 6,4 2,5 1,6 41.5,7 7.921}
{0 CHEMBL10347,1 3.8,2 5.8,3 5,4 3,5 0.996,6 36,7 7.398}
{0 CHEMBL104082,1 2.8,2 6.9,3 7,4 5,5 1,6 53.5,7 8.061}
{0 CHEMBL104455,1 2.9,2 7.4,3 7,4 5,5 1.001,6 51,7 8.666}
{0 CHEMBL105893,1 2.8,2 6.9,3 7,4 5,5 1,6 53.5,7 7.342}
{0 CHEMBL107213,1 2.9,2 7.2,3 7,4 5,5 1.001,6 52.5,7 7.257}
{0 CHEMBL107949,1 2.5,2 6.3,3 8,4 5,5 0.995,6 48,7 7.208}
{0 CHEMBL117345,1 6.1,3 3,5 0.98,6 34,7 6}
{0 CHEMBL117984,1 5.9,3 3,5 0.979,6 33,7 6}
{0 CHEMBL118151,1 6.7,3 3,5 0.981,6 31,7 6}
{0 CHEMBL118642,1 6.7,3 3,5 0.981,6 31,7 6}
{0 CHEMBL119046,1 7.1,3 3,5 0.982,6 30,7 6}
{0 CHEMBL119289,1 6.7,3 3,5 0.981,6 31,7 6}
{0 CHEMBL119290,1 6.7,3 3,5 0.981,6 31,7 6}
{0 CHEMBL119336,1 3.3,3 2,5 0.971,6 31,7 7.342}
{0 CHEMBL119434,1 6.3,3 3,5 0.98,6 32,7 6}
{0 CHEMBL119639,1 5.8,3 3,5 0.979,6 35,7 6}
{0 CHEMBL120011,1 5.8,3 3,5 0.981,6 40,7 6}
{0 CHEMBL122220,1 3.4,2 6.8,3 9,4 4,5 1.023,6 39,7 5.479}
{0 CHEMBL122332,1 1.1,2 4.2,3 8,4 4,5 0.998,6 51,7 7.062}
{0 CHEMBL122671,1 6.2,2 4.9,3 9,4 4,5 0.999,6 64,7 8}
{0 CHEMBL122740,1 2.2,2 4.5,3 9,4 4,5 1.002,6 49,7 7.759}
{0 CHEMBL123102,1 4.8,2 6,3 9,4 5,5 1.001,6 65,7 7.523}
{0 CHEMBL123211,1 1.3,2 5.2,3 8,4 4,5 1.007,6 45,7 7.777}
{0 CHEMBL123325,1 4,2 6,3 5,4 3,5 0.998,6 37,7 6.539}
{0 CHEMBL123769,1 3.7,2 7.3,3 9,4 6,5 1.004,6 65,7 6.87}
{0 CHEMBL124442,1 1.4,2 5.6,3 8,4 4,5 1.01,6 43,7 7.866}
{0 CHEMBL124727,1 1.9,2 7.5,3 8,4 4,5 1.027,6 37,7 8.668}
{0 CHEMBL125294,1 6,2 4.8,3 9,4 4,5 0.998,6 65,7 5.301}
{0 CHEMBL125651,1 2.4,2 4.8,3 9,4 4,5 1.005,6 47,7 5.932}
{0 CHEMBL125814,1 2,2 4,3 9,4 4,5 0.997,6 53,7 7.197}
{0 CHEMBL125824,1 1.5,2 6.2,3 8,4 4,5 1.015,6 41,7 8.62}
{0 CHEMBL136357,1 3.2,2 3.2,3 5,4 2,5 0.983,6 32,7 5.824}
{0 CHEMBL136432,1 3.5,2 3.5,3 5,4 2,5 0.99,6 40.5,7 6.194}
{0 CHEMBL137009,1 5.3,2 1.8,3 6,4 1,5 0.995,6 40,7 6.119}
{0 CHEMBL137094,1 4.6,2 2.3,3 8,4 2,5 0.986,6 54,7 6.638}
{0 CHEMBL137151,1 2.4,2 4.8,3 7,4 4,5 0.988,6 47,7 7.032}
{0 CHEMBL137172,1 2.5,2 4.9,3 7,4 4,5 0.989,6 46,7 6.638}
{0 CHEMBL137324,1 2.4,2 7.1,3 9,4 6,5 0.998,6 50,7 6.367}
{0 CHEMBL137352,1 2.2,2 6.7,3 9,4 6,5 0.995,6 50,7 6.523}
{0 CHEMBL137390,1 2.9,2 2.9,3 5,4 2,5 0.982,6 36,7 5.921}
{0 CHEMBL137426,1 3.5,2 3.5,3 5,4 2,5 0.986,6 30,7 5.357}
{0 CHEMBL137436,1 2.7,2 2.7,3 5,4 2,5 0.983,6 42,7 6.222}
{0 CHEMBL137514,1 3.3,2 3.3,3 5,4 2,5 0.985,6 31,7 5.62}
{0 CHEMBL138126,1 3,2 4.5,3 6,4 3,5 0.988,6 34,7 5.481}
{0 CHEMBL138484,1 4.1,2 2.7,3 6,4 2,5 0.983,6 36,7 5.77}
{0 CHEMBL138800,1 2.5,2 4.9,3 7,4 4,5 0.989,6 46,7 6.921}
{0 CHEMBL139134,1 2.6,2 5.1,3 4,4 2,5 0.997,6 32,7 7.456}
{0 CHEMBL1491,1 3.8,2 9.4,3 8,4 5,5 1.014,6 36,7 8.699}
{0 CHEMBL15245,1 3.8,2 5.8,3 5,4 3,5 0.996,6 36,7 7.347}
{0 CHEMBL180561,1 5.8,2 4.7,3 9,4 4,5 0.997,6 64,7 6}
{0 CHEMBL1835153,1 14,2 2,3 11,4 1,5 1.035,6 47.5,7 4.523}
{0 CHEMBL193,1 4.7,2 14,3 8,4 6,5 1.029,6 35,7 8.456}
{0 CHEMBL197,1 2.8,2 5.6,3 6,4 4,5 0.992,6 42,7 7.409}
{0 CHEMBL2051962,1 5.2,2 10.3,3 9,4 6,5 1.014,6 40,7 6}
{0 CHEMBL2092919,1 3.9,2 7.9,3 9,4 6,5 1.002,6 46,7 6.304}
{0 CHEMBL2111604,1 5.2,2 10.3,3 9,4 6,5 1.014,6 40,7 4.863}
{0 CHEMBL23,1 3.6,2 7.3,3 7,4 4,5 1.003,6 39,7 6.277}
{0 CHEMBL24086,1 3.8,3 4,5 0.987,6 45.5,7 7.585}
{0 CHEMBL24675,1 2.9,2 4.4,3 6,4 3,5 0.993,6 51.5,7 8.081}
{0 CHEMBL275195,1 3.9,2 3.9,3 5,4 2,5 0.993,6 38.5,7 6.796}
{0 CHEMBL277363,1 4.3,2 2.1,3 4,4 1,5 0.988,6 36.5,7 7.523}
{0 CHEMBL29835,1 8.3,3 3,5 0.986,6 29,7 4}
{0 CHEMBL31410,1 3.8,2 5.8,3 5,4 3,5 0.996,6 36,7 5.903}
{0 CHEMBL317651,1 2.9,2 7.4,3 7,4 5,5 1.001,6 51,7 7.971}
{0 CHEMBL323782,1 3.2,2 8.1,3 7,4 5,5 1.003,6 43.5,7 7.604}
{0 CHEMBL324822,1 7.7,3 3,5 0.984,6 29,7 6}
{0 CHEMBL325811,1 2.9,2 7.2,3 8,4 5,5 1.005,6 53.5,7 8.249}
{0 CHEMBL33083,1 2.6,2 5.1,3 4,4 2,5 1,6 37.5,7 6.658}
{0 CHEMBL331328,1 8.3,3 3,5 0.986,6 28,7 6}
{0 CHEMBL331446,1 2.8,2 5.6,3 9,4 4,5 1.013,6 43,7 6.631}
{0 CHEMBL33165,1 2.3,2 7,3 5,4 3,5 1.005,6 39.5,7 6.469}
{0 CHEMBL332316,1 7.1,3 3,5 0.982,6 30,7 6}
{0 CHEMBL332346,1 1.2,2 4.8,3 8,4 4,5 1.003,6 47,7 7.804}
{0 CHEMBL334294,1 6.3,3 3,5 0.98,6 32,7 6}
{0 CHEMBL335343,1 2.4,2 2.4,3 5,4 2,5 0.98,6 47,7 6.678}
{0 CHEMBL33609,1 2,2 6.1,3 5,4 3,5 1,6 41.5,7 6.824}
{0 CHEMBL336705,1 2.6,2 5.3,3 7,4 4,5 0.992,6 46,7 6.602}
{0 CHEMBL341710,1 2.7,2 4.1,3 6,4 3,5 0.985,6 36,7 6.076}
{0 CHEMBL344252,1 2.5,2 4.9,3 7,4 4,5 0.989,6 46,7 6.377}
{0 CHEMBL344472,1 2.4,2 4.9,3 7,4 4,5 0.99,6 48,7 6.699}
{0 CHEMBL386435,1 5.1,2 5.1,3 6,4 2,5 1.005,6 27,7 5.52}
{0 CHEMBL405355,1 3.6,2 7.1,3 9,4 6,5 1.002,6 64,7 8.046}
{0 CHEMBL410937,1 2.6,2 5.2,3 9,4 4,5 1.009,6 45,7 7.762}
{0 CHEMBL416040,1 2.1,2 4.2,3 4,4 2,5 0.993,6 40.5,7 6.215}
{0 CHEMBL423535,1 2.4,2 5.9,3 8,4 5,5 0.992,6 48,7 6.745}
{0 CHEMBL431669,1 7.1,3 3,5 0.982,6 30,7 6}
{0 CHEMBL432982,1 6.1,3 3,5 0.982,6 39,7 6}
{0 CHEMBL433189,1 6.3,3 3,5 0.98,6 32,7 6}
{0 CHEMBL441653,1 2.7,3 2,5 0.971,6 40,7 6}
{0 CHEMBL445063,1 6.3,3 3,5 0.98,6 32,7 6}
{0 CHEMBL448620,1 4.7,2 5.9,3 9,4 5,5 0.999,6 64,7 6.152}
{0 CHEMBL539426,1 2.7,2 8.2,3 8,4 6,5 1.004,6 54.5,7 7.517}
{0 CHEMBL609700,1 5.2,2 10.3,3 9,4 6,5 1.014,6 40,7 5.82}
{0 CHEMBL609701,1 3.9,2 7.9,3 9,4 6,5 1.002,6 46,7 7.003}
