"molecule_id","Mp","nAB","nCsp3","nBM","pXC50"
{1 0.634,2 5,3 3,4 7,5 4.602}
{0 CHEMBL117962,1 0.683,2 11,3 3,4 13,5 5.155}
{0 CHEMBL119709,1 0.705,2 16,3 6,4 17,5 5}
{0 CHEMBL1625681,1 0.668,2 11,3 5,4 13,5 5.678}
{0 CHEMBL1672627,1 0.698,2 18,3 3,4 19,5 6.291}
{0 CHEMBL1788234,1 0.668,2 11,3 5,4 13,5 5.119}
{0 CHEMBL190,1 0.641,2 5,3 2,4 7,5 4.796}
{0 CHEMBL2111766,1 0.665,2 11,3 6,4 14,5 5.432}
{0 CHEMBL260933,1 0.653,2 16,3 7,4 18,5 8.699}
{0 CHEMBL273807,1 0.669,2 17,3 7,4 21,5 8.47}
{0 CHEMBL279898,1 0.634,2 5,3 3,4 7,5 4.745}
{0 CHEMBL324138,1 0.677,2 11,3 2,4 13,5 5.284}
{0 CHEMBL375293,1 0.716,2 23,4 23,5 6.326}
{0 CHEMBL431733,1 0.723,2 16,3 6,4 17,5 5}
{0 CHEMBL483688,1 0.688,2 17,3 7,4 21,5 9.455}
