"molecule_id","FCFP4_1024b674","FCFP4_1024b1","FCFP4_1024b10","FCFP4_1024b100","FCFP4_1024b1000","FCFP4_1024b1001","FCFP4_1024b1002","FCFP4_1024b1003","FCFP4_1024b1004","FCFP4_1024b1005","FCFP4_1024b1006","FCFP4_1024b1007","FCFP4_1024b1008","FCFP4_1024b1009","FCFP4_1024b101","FCFP4_1024b1010","FCFP4_1024b1011","FCFP4_1024b1012","FCFP4_1024b1013","FCFP4_1024b1014","FCFP4_1024b1015","FCFP4_1024b1016","FCFP4_1024b1017","FCFP4_1024b1018","FCFP4_1024b1019","FCFP4_1024b102","FCFP4_1024b1020","FCFP4_1024b1021","FCFP4_1024b1022","FCFP4_1024b1023","FCFP4_1024b1024","FCFP4_1024b103","FCFP4_1024b104","FCFP4_1024b105","FCFP4_1024b106","FCFP4_1024b107","FCFP4_1024b108","FCFP4_1024b109","FCFP4_1024b11","FCFP4_1024b110","FCFP4_1024b111","FCFP4_1024b112","FCFP4_1024b113","FCFP4_1024b114","FCFP4_1024b115","FCFP4_1024b116","FCFP4_1024b117","FCFP4_1024b118","FCFP4_1024b119","FCFP4_1024b12","FCFP4_1024b120","pXC50"
{1 1,2 1,3 1,44 1,52 6.377}
{0 CHEMBL137485,1 1,2 1,3 1,44 1,52 7.494}
{0 CHEMBL159174,1 1,2 1,44 1,52 7.222}
{0 CHEMBL15928,2 1,3 1,7 1,36 1,52 8.5}
{0 CHEMBL297784,1 1,2 1,36 1,52 6}
{0 CHEMBL306384,2 1,3 1,7 1,36 1,52 8.2}
{0 CHEMBL309021,2 1,3 1,17 1,25 1,36 1,52 8}
{0 CHEMBL311150,2 1,3 1,25 1,36 1,52 8.3}
{0 CHEMBL39,2 1,44 1,52 8.284}
{0 CHEMBL72088,2 1,3 1,17 1,36 1,52 8.5}
{0 CHEMBL72092,2 1,3 1,16 1,25 1,36 1,52 7.5}
{0 CHEMBL7257,1 1,2 1,3 1,44 1,52 7.31}
{0 CHEMBL72700,2 1,3 1,25 1,36 1,52 8.2}
{0 CHEMBL72981,2 1,3 1,17 1,36 1,52 8.3}
{0 CHEMBL73446,2 1,3 1,25 1,36 1,52 8.5}
{0 CHEMBL75642,2 1,3 1,44 1,52 10.377}
{0 CHEMBL80189,2 1,3 1,44 1,52 7.854}
