{
  "data_set_description": {
    "collection_date": "November 2013",
    "creator": "Dr Jeremy Besnard, Dr Ivan Olier, Dr Noureddin Sadawi, Dr Larisa Soldatova, Dr Crina Grosan, Prof Ross King, Dr Richard Bickerton, Prof Andrew Hopkins and Dr Willem van Hoorn",
    "default_target_attribute": "pXC50",
    "description": "This dataset contains QSAR data (from ChEMBL version 17) showing activity values (unit is pseudo-pCI50) of several compounds on drug target ChEMBL_ID: CHEMBL2056 (TID: 88), and it has 895 rows and 1377 features (not including molecule IDs and class feature: molecule_id and pXC50). The features represent Molecular Descriptors which were generated from SMILES strings. Missing value imputation was applied to this dataset (By choosing the Median).",
    "description_version": "1",
    "file_id": "3277702",
    "format": "ARFF",
    "id": "25559",
    "licence": "Public",
    "md5_checksum": "9b065a331b9b5aa7aec40c860e196d59",
    "minio_url": "https://data.openml.org/datasets/0002/25559/dataset_25559.pq",
    "name": "QSAR-DATASET-FOR-DRUG-TARGET-CHEMBL2056",
    "original_data_url": "https://www.ebi.ac.uk/chembl/target/inspect/CHEMBL2056",
    "parquet_url": "https://data.openml.org/datasets/0002/25559/dataset_25559.pq",
    "processing_date": "2018-10-03 23:09:23",
    "row_id_attribute": "molecule_id",
    "status": "deactivated",
    "tag": [
      "MetaQSAR",
      "study_13"
    ],
    "upload_date": "2016-07-14T17:13:09",
    "url": "https://api.openml.org/data/v1/download/3277702/QSAR-DATASET-FOR-DRUG-TARGET-CHEMBL2056.arff",
    "version": "8",
    "visibility": "public"
  }
}