{
  "data_set_description": {
    "collection_date": "November 2013",
    "creator": "Dr Jeremy Besnard, Dr Ivan Olier, Dr Noureddin Sadawi, Dr Larisa Soldatova, Dr Crina Grosan, Prof Ross King, Dr Richard Bickerton, Prof Andrew Hopkins and Dr Willem van Hoorn",
    "default_target_attribute": "pXC50",
    "description": "This dataset contains QSAR data (from ChEMBL version 17) showing activity values (unit is pseudo-pCI50) of several compounds on drug target ChEMBL_ID: CHEMBL3835 (TID: 30017), and it has 1058 rows and 1391 features (not including molecule IDs and class feature: molecule_id and pXC50). The features represent Molecular Descriptors which were generated from SMILES strings. Missing value imputation was applied to this dataset (By choosing the Median).",
    "description_version": "1",
    "file_id": "3276842",
    "format": "ARFF",
    "id": "25535",
    "licence": "Public",
    "md5_checksum": "6244f2d3db7fefa798577a09ed3db3f6",
    "minio_url": "https://data.openml.org/datasets/0002/25535/dataset_25535.pq",
    "name": "QSAR-DATASET-FOR-DRUG-TARGET-CHEMBL3835",
    "original_data_url": "https://www.ebi.ac.uk/chembl/target/inspect/CHEMBL3835",
    "parquet_url": "https://data.openml.org/datasets/0002/25535/dataset_25535.pq",
    "processing_date": "2018-10-03 23:14:05",
    "row_id_attribute": "molecule_id",
    "status": "deactivated",
    "tag": [
      "MetaQSAR",
      "study_13"
    ],
    "upload_date": "2016-07-14T17:09:47",
    "url": "https://api.openml.org/data/v1/download/3276842/QSAR-DATASET-FOR-DRUG-TARGET-CHEMBL3835.arff",
    "version": "7",
    "visibility": "public"
  }
}