"molecule_id","AMW","C.","H.","Me","Mi","Mp","Mv","MW","N.","nAB","nAT","nB","nBM","nBO","nBR","nBT","nC","nCL","nCsp","nCsp2","nCsp3","nDB","nF","nH","nHet","nHM","nI","nN","nO","nP","nS","nSK","nTB","nX","O.","RBF","RBN","SCBO","Se","Si","Sp","Sv","X.","pXC50"
{1 6.283,2 36.8,3 54.7,4 0.992,5 1.133,6 0.619,7 0.574,8 596.89,9 2.1,10 6,11 95,13 9,14 47,16 99,17 35,20 9,21 26,22 3,24 52,25 8,28 2,29 6,32 43,35 6.3,36 0.101,37 10,38 53,39 94.257,40 107.633,41 58.773,42 54.502,44 5.697}
{0 CHEMBL1170054,1 6.646,2 36.8,3 53.7,4 0.996,5 1.132,6 0.628,7 0.582,8 631.33,9 2.1,10 6,11 95,13 9,14 48,16 99,17 35,18 1,20 9,21 26,22 3,24 51,25 9,26 1,28 2,29 6,32 44,34 1,35 6.3,36 0.101,37 10,38 54,39 94.581,40 107.577,41 59.631,42 55.329,43 1.1,44 5.719}
{0 CHEMBL1170055,1 6.785,2 36.7,3 52,4 1.007,5 1.144,6 0.616,7 0.583,8 664.89,9 2,10 6,11 98,13 9,14 51,16 102,17 36,20 9,21 27,22 3,23 3,24 51,25 11,28 2,29 6,32 47,34 3,35 6.1,36 0.098,37 10,38 57,39 98.679,40 112.067,41 60.347,42 57.178,43 3.1,44 5.695}
{0 CHEMBL1170056,1 6.472,2 36.8,3 53.7,4 0.998,5 1.137,6 0.618,7 0.578,8 614.88,9 2.1,10 6,11 95,13 9,14 48,16 99,17 35,20 9,21 26,22 3,23 1,24 51,25 9,28 2,29 6,32 44,34 1,35 6.3,36 0.101,37 10,38 54,39 94.77,40 107.973,41 58.711,42 54.885,43 1.1,44 5.636}
{0 CHEMBL1170057,1 6.472,2 36.8,3 53.7,4 0.998,5 1.137,6 0.618,7 0.578,8 614.88,9 2.1,10 6,11 95,13 9,14 48,16 99,17 35,20 9,21 26,22 3,23 1,24 51,25 9,28 2,29 6,32 44,34 1,35 6.3,36 0.101,37 10,38 54,39 94.77,40 107.973,41 58.711,42 54.885,43 1.1,44 5.903}
{0 CHEMBL1170058,1 6.472,2 36.8,3 53.7,4 0.998,5 1.137,6 0.618,7 0.578,8 614.88,9 2.1,10 6,11 95,13 9,14 48,16 99,17 35,20 9,21 26,22 3,23 1,24 51,25 9,28 2,29 6,32 44,34 1,35 6.3,36 0.101,37 10,38 54,39 94.77,40 107.973,41 58.711,42 54.885,43 1.1,44 5.52}
{0 CHEMBL1170059,1 6.234,2 36.7,3 55.1,4 0.991,5 1.133,6 0.618,7 0.572,8 610.92,9 2,10 6,11 98,13 9,14 48,16 102,17 36,20 9,21 27,22 3,24 54,25 8,28 2,29 6,32 44,35 6.1,36 0.098,37 10,38 54,39 97.141,40 111.048,41 60.535,42 56.028,44 5.58}
{0 CHEMBL1170060,1 6.234,2 36.7,3 55.1,4 0.991,5 1.133,6 0.618,7 0.572,8 610.92,9 2,10 6,11 98,13 9,14 48,16 102,17 36,20 9,21 27,22 3,24 54,25 8,28 2,29 6,32 44,35 6.1,36 0.098,37 10,38 54,39 97.141,40 111.048,41 60.535,42 56.028,44 6.051}
{0 CHEMBL1170061,1 6.234,2 36.7,3 55.1,4 0.991,5 1.133,6 0.618,7 0.572,8 610.92,9 2,10 6,11 98,13 9,14 48,16 102,17 36,20 9,21 27,22 3,24 54,25 8,28 2,29 6,32 44,35 6.1,36 0.098,37 10,38 54,39 97.141,40 111.048,41 60.535,42 56.028,44 5.495}
{0 CHEMBL1170062,1 6.333,2 36.4,3 54.5,4 0.995,5 1.134,6 0.616,7 0.573,8 626.92,9 2,10 6,11 99,13 9,14 49,16 103,17 36,20 9,21 27,22 3,24 54,25 9,28 2,29 7,32 45,35 7.1,36 0.107,37 11,38 55,39 98.468,40 112.258,41 60.989,42 56.743,44 5.41}
{0 CHEMBL1170063,1 6.333,2 36.4,3 54.5,4 0.995,5 1.134,6 0.616,7 0.573,8 626.92,9 2,10 6,11 99,13 9,14 49,16 103,17 36,20 9,21 27,22 3,24 54,25 9,28 2,29 7,32 45,35 7.1,36 0.107,37 11,38 55,39 98.468,40 112.258,41 60.989,42 56.743,44 5.375}
{0 CHEMBL1170064,1 6.333,2 36.4,3 54.5,4 0.995,5 1.134,6 0.616,7 0.573,8 626.92,9 2,10 6,11 99,13 9,14 49,16 103,17 36,20 9,21 27,22 3,24 54,25 9,28 2,29 7,32 45,35 7.1,36 0.107,37 11,38 55,39 98.468,40 112.258,41 60.989,42 56.743,44 5.215}
{0 CHEMBL1170065,1 6.103,2 36.4,3 56.1,4 0.989,5 1.134,6 0.615,7 0.566,8 653.01,9 1.9,10 6,11 107,13 9,14 51,16 111,17 39,20 9,21 30,22 3,24 60,25 8,28 2,29 6,32 47,35 5.6,36 0.099,37 11,38 57,39 105.792,40 121.294,41 65.819,42 60.609,44 5.406}
{0 CHEMBL1170066,1 6.103,2 36.4,3 56.1,4 0.989,5 1.134,6 0.615,7 0.566,8 653.01,9 1.9,10 6,11 107,13 9,14 51,16 111,17 39,20 9,21 30,22 3,24 60,25 8,28 2,29 6,32 47,35 5.6,36 0.099,37 11,38 57,39 105.792,40 121.294,41 65.819,42 60.609,44 6.231}
{0 CHEMBL1170067,1 6.103,2 36.4,3 56.1,4 0.989,5 1.134,6 0.615,7 0.566,8 653.01,9 1.9,10 6,11 107,13 9,14 51,16 111,17 39,20 9,21 30,22 3,24 60,25 8,28 2,29 6,32 47,35 5.6,36 0.099,37 11,38 57,39 105.792,40 121.294,41 65.819,42 60.609,44 6.561}
{0 CHEMBL1170068,1 6.484,2 36.6,3 53.5,4 0.998,5 1.133,6 0.618,7 0.579,8 654.93,9 2,10 6,11 101,13 10,14 51,16 105,17 37,20 10,21 27,22 4,24 54,25 10,28 2,29 8,32 47,35 7.9,36 0.114,37 12,38 58,39 100.796,40 114.467,41 62.444,42 58.458,44 5.638}
{0 CHEMBL1170240,1 6.484,2 36.6,3 53.5,4 0.998,5 1.133,6 0.618,7 0.579,8 654.93,9 2,10 6,11 101,13 10,14 51,16 105,17 37,20 10,21 27,22 4,24 54,25 10,28 2,29 8,32 47,35 7.9,36 0.114,37 12,38 58,39 100.796,40 114.467,41 62.444,42 58.458,44 5.116}
{0 CHEMBL1170241,1 6.484,2 36.6,3 53.5,4 0.998,5 1.133,6 0.618,7 0.579,8 654.93,9 2,10 6,11 101,13 10,14 51,16 105,17 37,20 10,21 27,22 4,24 54,25 10,28 2,29 8,32 47,35 7.9,36 0.114,37 12,38 58,39 100.796,40 114.467,41 62.444,42 58.458,44 5.395}
{0 CHEMBL1170242,1 6.432,2 36.5,3 53.8,4 0.997,5 1.133,6 0.617,7 0.577,8 668.96,9 1.9,10 6,11 104,13 10,14 52,16 108,17 38,20 10,21 28,22 4,24 56,25 10,28 2,29 8,32 48,35 7.7,36 0.12,37 13,38 59,39 103.679,40 117.882,41 64.205,42 59.985,44 5.939}
{0 CHEMBL1170243,1 6.432,2 36.5,3 53.8,4 0.997,5 1.133,6 0.617,7 0.577,8 668.96,9 1.9,10 6,11 104,13 10,14 52,16 108,17 38,20 10,21 28,22 4,24 56,25 10,28 2,29 8,32 48,35 7.7,36 0.12,37 13,38 59,39 103.679,40 117.882,41 64.205,42 59.985,44 5.287}
{0 CHEMBL1170244,1 6.357,2 35.7,3 54.5,4 0.996,5 1.136,6 0.614,7 0.572,8 712.04,9 2.7,10 6,11 112,13 10,14 55,16 116,17 40,20 10,21 30,22 4,24 61,25 11,28 3,29 8,32 51,35 7.1,36 0.112,37 13,38 62,39 111.548,40 127.211,41 68.734,42 64.06,44 5.185}
{0 CHEMBL1170245,1 6.357,2 35.7,3 54.5,4 0.996,5 1.136,6 0.614,7 0.572,8 712.04,9 2.7,10 6,11 112,13 10,14 55,16 116,17 40,20 10,21 30,22 4,24 61,25 11,28 3,29 8,32 51,35 7.1,36 0.112,37 13,38 62,39 111.548,40 127.211,41 68.734,42 64.06,44 5.279}
{0 CHEMBL1170246,1 6.308,2 36.1,3 54.6,4 0.993,5 1.135,6 0.616,7 0.572,8 611.91,9 3.1,10 6,11 97,13 9,14 48,16 101,17 35,20 9,21 26,22 3,24 53,25 9,28 3,29 6,32 44,35 6.2,36 0.099,37 10,38 54,39 96.359,40 110.131,41 59.779,42 55.523,44 5.578}
{0 CHEMBL1170247,1 6.308,2 36.1,3 54.6,4 0.993,5 1.135,6 0.616,7 0.572,8 611.91,9 3.1,10 6,11 97,13 9,14 48,16 101,17 35,20 9,21 26,22 3,24 53,25 9,28 3,29 6,32 44,35 6.2,36 0.099,37 10,38 54,39 96.359,40 110.131,41 59.779,42 55.523,44 4.788}
{0 CHEMBL1170248,1 6.308,2 36.1,3 54.6,4 0.993,5 1.135,6 0.616,7 0.572,8 611.91,9 3.1,10 6,11 97,13 9,14 48,16 101,17 35,20 9,21 26,22 3,24 53,25 9,28 3,29 6,32 44,35 6.2,36 0.099,37 10,38 54,39 96.359,40 110.131,41 59.779,42 55.523,44 4.799}
{0 CHEMBL1170249,1 6.662,2 36.8,3 52.6,4 1.003,5 1.14,6 0.617,7 0.582,8 632.87,9 2.1,10 6,11 95,13 9,14 49,16 99,17 35,20 9,21 26,22 3,23 2,24 50,25 10,28 2,29 6,32 45,34 2,35 6.3,36 0.101,37 10,38 55,39 95.283,40 108.312,41 58.648,42 55.268,43 2.1,44 5.5}
{0 CHEMBL1170250,1 6.188,2 36.6,3 55.4,4 0.99,5 1.133,6 0.617,7 0.57,8 624.95,9 2,10 6,11 101,13 9,14 49,16 105,17 37,20 9,21 28,22 3,24 56,25 8,28 2,29 6,32 45,35 5.9,36 0.095,37 10,38 55,39 100.025,40 114.463,41 62.296,42 57.555,44 5.093}
{0 CHEMBL1170251,1 6.188,2 36.6,3 55.4,4 0.99,5 1.133,6 0.617,7 0.57,8 624.95,9 2,10 6,11 101,13 9,14 49,16 105,17 37,20 9,21 28,22 3,24 56,25 8,28 2,29 6,32 45,35 5.9,36 0.095,37 10,38 55,39 100.025,40 114.463,41 62.296,42 57.555,44 5.367}
{0 CHEMBL1170252,1 6.378,2 35.9,3 54.4,4 0.997,5 1.135,6 0.614,7 0.573,8 656.95,9 1.9,10 6,11 103,13 9,14 51,16 107,17 37,20 9,21 28,22 3,24 56,25 10,28 2,29 8,32 47,35 7.8,36 0.112,37 12,38 57,39 102.679,40 116.882,41 63.205,42 58.985,44 5.285}
{0 CHEMBL1170253,1 6.67,2 38.4,3 51.8,4 0.999,5 1.13,6 0.629,7 0.591,8 747.03,9 1.8,10 12,11 112,13 16,14 59,16 117,17 43,20 16,21 27,22 4,24 58,25 11,28 2,29 9,32 54,35 8,36 0.128,37 15,38 69,39 111.89,40 126.507,41 70.421,42 66.226,44 5.65}
{0 CHEMBL1170254,1 6.54,2 36.7,3 53.1,4 0.999,5 1.133,6 0.619,7 0.581,8 640.9,9 2,10 6,11 98,13 10,14 50,16 102,17 36,20 10,21 26,22 4,24 52,25 10,28 2,29 8,32 46,35 8.2,36 0.108,37 11,38 57,39 97.912,40 111.052,41 60.682,42 56.931,44 4.394}
{0 CHEMBL1170255,1 6.54,2 36.7,3 53.1,4 0.999,5 1.133,6 0.619,7 0.581,8 640.9,9 2,10 6,11 98,13 10,14 50,16 102,17 36,20 10,21 26,22 4,24 52,25 10,28 2,29 8,32 46,35 8.2,36 0.108,37 11,38 57,39 97.912,40 111.052,41 60.682,42 56.931,44 4.445}
{0 CHEMBL1170258,1 6.484,2 36.6,3 53.5,4 0.998,5 1.133,6 0.618,7 0.579,8 654.93,9 2,10 6,11 101,13 10,14 51,16 105,17 37,20 10,21 27,22 4,24 54,25 10,28 2,29 8,32 47,35 7.9,36 0.114,37 12,38 58,39 100.796,40 114.467,41 62.444,42 58.458,44 4.387}
{0 CHEMBL122229,1 6.15,2 34.6,3 57,4 0.986,5 1.136,6 0.619,7 0.562,8 658.09,9 3.7,10 12,11 107,13 15,14 48,16 109,17 37,20 13,21 24,22 3,24 61,25 9,26 1,28 4,29 4,31 1,32 46,35 3.7,36 0.156,37 17,38 57,39 105.475,40 121.584,41 66.188,42 60.146,44 7.081}
{0 CHEMBL122498,1 6.663,2 36.2,3 53.6,4 0.991,5 1.132,6 0.637,7 0.585,8 459.72,9 4.3,10 12,11 69,13 14,14 34,16 71,17 25,20 12,21 13,22 2,24 37,25 7,26 1,28 3,29 3,31 1,32 32,35 4.3,36 0.113,37 8,38 42,39 68.385,40 78.102,41 43.972,42 40.351,44 8.222}
{0 CHEMBL122745,1 7.097,2 36.2,3 50.7,4 1.002,5 1.132,6 0.639,7 0.598,8 489.7,9 4.3,10 12,11 69,13 16,14 36,16 71,17 25,20 12,21 13,22 4,24 35,25 9,26 1,28 3,29 5,31 1,32 34,35 7.2,36 0.127,37 9,38 46,39 69.156,40 78.105,41 44.12,42 41.254,44 7.357}
{0 CHEMBL123319,1 6.686,2 36.6,3 53.5,4 0.993,5 1.13,6 0.636,7 0.586,8 474.73,9 2.8,10 12,11 71,13 14,14 35,16 73,17 26,20 12,21 14,22 2,24 38,25 7,26 1,28 2,29 4,31 1,32 33,35 5.6,36 0.11,37 8,38 43,39 70.494,40 80.228,41 45.182,42 41.571,44 6.237}
{0 CHEMBL123444,1 7.404,2 36,3 53.5,4 0.993,5 1.131,6 0.646,7 0.59,8 636.77,9 3.5,10 12,11 86,13 15,14 42,15 1,16 88,17 31,20 13,21 18,22 3,24 46,25 9,26 2,28 3,29 4,31 1,32 40,34 1,35 4.7,36 0.136,37 12,38 51,39 85.359,40 97.229,41 55.586,42 50.725,43 1.2,44 6.161}
{0 CHEMBL123542,1 6.605,2 36.5,3 54.1,4 0.992,5 1.13,6 0.634,7 0.582,8 488.76,9 2.7,10 12,11 74,13 14,14 36,16 76,17 27,20 12,21 15,22 2,24 40,25 7,26 1,28 2,29 4,31 1,32 34,35 5.4,36 0.118,37 9,38 44,39 73.378,40 83.643,41 46.944,42 43.098,44 5.921}
{0 CHEMBL124239,1 7.146,2 36.4,3 51.9,4 0.997,5 1.131,6 0.647,7 0.597,8 550.23,9 3.9,10 12,11 77,13 15,14 39,16 79,17 28,18 1,20 13,21 15,22 3,24 40,25 9,26 2,28 3,29 4,31 1,32 37,34 1,35 5.2,36 0.114,37 9,38 48,39 76.803,40 87.085,41 49.807,42 45.947,43 1.3,44 6.013}
{0 CHEMBL124715,1 6.605,2 36.5,3 54.1,4 0.992,5 1.13,6 0.634,7 0.582,8 488.76,9 2.7,10 12,11 74,13 14,14 36,16 76,17 27,20 12,21 15,22 2,24 40,25 7,26 1,28 2,29 4,31 1,32 34,35 5.4,36 0.118,37 9,38 44,39 73.378,40 83.643,41 46.944,42 43.098,44 6.244}
{0 CHEMBL125997,1 6.686,2 36.6,3 53.5,4 0.993,5 1.13,6 0.636,7 0.586,8 474.73,9 2.8,10 12,11 71,13 14,14 35,16 73,17 26,20 12,21 14,22 2,24 38,25 7,26 1,28 2,29 4,31 1,32 33,35 5.6,36 0.123,37 9,38 43,39 70.494,40 80.228,41 45.182,42 41.571,44 7.585}
{0 CHEMBL1551,1 5.774,2 35.3,3 58.8,4 0.985,5 1.134,6 0.604,7 0.55,8 392.64,11 68,13 1,14 31,16 71,17 24,20 1,21 23,22 1,24 40,25 4,29 4,32 28,35 5.9,36 0.056,37 4,38 32,39 66.981,40 77.142,41 41.046,42 37.395,44 4.125}
{0 CHEMBL160,1 6.137,2 31.6,3 56.6,4 0.996,5 1.147,6 0.595,7 0.552,8 1202.84,9 5.6,11 196,13 12,14 85,16 196,17 62,20 13,21 49,22 12,24 111,25 23,28 11,29 12,32 85,35 6.1,36 0.077,37 15,38 97,39 195.227,40 224.754,41 116.587,42 108.153,44 4.62}
{0 CHEMBL17614,1 7.545,2 37.9,3 46.3,4 1.025,5 1.129,6 0.627,7 0.614,8 716.8,10 17,11 95,13 20,14 54,16 98,17 36,20 19,21 17,22 3,24 44,25 15,29 15,32 51,35 15.8,36 0.163,37 16,38 65.5,39 97.349,40 107.275,41 59.568,42 58.312,44 5.553}
{0 CHEMBL17687,1 7.039,2 40,3 49,4 1.003,5 1.135,6 0.641,7 0.608,8 703.93,9 4,10 18,11 100,13 21,14 56,16 105,17 40,20 22,21 18,22 3,23 2,24 49,25 11,28 4,29 5,32 51,34 2,35 5,36 0.152,37 16,38 68,39 100.334,40 113.477,41 64.063,42 60.806,43 2,44 5.971}
{0 CHEMBL17879,1 6.491,2 38.5,3 53.8,4 0.987,5 1.127,6 0.641,7 0.587,8 675.06,9 2.9,10 18,11 104,13 20,14 53,16 109,17 40,20 18,21 22,22 2,24 56,25 8,26 1,28 3,29 4,31 1,32 48,35 3.8,36 0.119,37 13,38 64,39 102.606,40 117.255,41 66.66,42 61.071,44 6.051}
{0 CHEMBL17966,1 7.112,2 40.2,3 48.5,4 1.005,5 1.135,6 0.642,7 0.611,8 689.9,9 4.1,10 18,11 97,13 21,14 55,16 102,17 39,20 22,21 17,22 3,23 2,24 47,25 11,28 4,29 5,32 50,34 2,35 5.2,36 0.147,37 15,38 67,39 97.45,40 110.062,41 62.302,42 59.279,43 2.1,44 6.114}
{0 CHEMBL18219,1 6.58,2 37.5,3 54.2,4 0.99,5 1.127,6 0.638,7 0.584,8 473.74,9 1.4,10 12,11 72,13 14,14 35,16 74,17 27,20 12,21 15,22 2,24 39,25 6,26 1,28 1,29 4,31 1,32 33,35 5.6,36 0.122,37 9,38 43,39 71.276,40 81.145,41 45.938,42 42.077,44 4.201}
{0 CHEMBL182301,1 6.289,2 36,3 54.7,4 0.992,5 1.136,6 0.617,7 0.572,8 471.71,9 4,10 5,11 75,13 7,14 38,16 79,17 27,20 5,21 22,22 2,24 41,25 7,28 3,29 4,32 34,35 5.3,36 0.076,37 6,38 42.5,39 74.403,40 85.221,41 46.302,42 42.933,44 5.796}
{0 CHEMBL182671,1 6.493,2 38.2,3 52.8,4 0.993,5 1.131,6 0.63,7 0.587,8 577.84,9 3.4,10 11,11 89,13 13,14 47,16 94,17 34,20 11,21 23,22 2,24 47,25 8,28 3,29 5,32 42,35 5.6,36 0.085,37 8,38 54.5,39 88.381,40 100.676,41 56.04,42 52.228,44 5.824}
{0 CHEMBL182697,1 6.537,2 37.3,3 52.7,4 0.996,5 1.133,6 0.625,7 0.585,8 719.03,9 3.6,10 11,11 110,13 14,14 58,16 116,17 41,20 12,21 29,22 3,24 58,25 11,28 4,29 7,32 52,35 6.4,36 0.103,37 12,38 66.5,39 109.556,40 124.669,41 68.762,42 64.313,44 4.495}
{0 CHEMBL18380,1 7.209,2 40,3 48,4 1.011,5 1.125,6 0.637,7 0.612,8 540.66,10 17,11 75,13 19,14 41,16 77,17 30,20 18,21 12,22 2,24 36,25 9,29 9,32 39,35 12,36 0.169,37 13,38 51.5,39 75.851,40 84.358,41 47.796,42 45.916,44 5.593}
{0 CHEMBL184982,1 6.29,2 35.4,3 54.9,4 0.994,5 1.137,6 0.613,7 0.57,8 515.77,9 3.7,10 5,11 82,13 7,14 41,16 86,17 29,20 5,21 24,22 2,24 45,25 8,28 3,29 5,32 37,35 6.1,36 0.093,37 8,38 45.5,39 81.498,40 93.261,41 50.279,42 46.701,44 4.658}
{0 CHEMBL185179,1 6.158,2 36.5,3 55.4,4 0.988,5 1.135,6 0.62,7 0.571,8 455.71,9 4.1,10 5,11 74,13 7,14 37,16 78,17 27,20 5,21 22,22 2,24 41,25 6,28 3,29 3,32 33,35 4.1,36 0.077,37 6,38 41.5,39 73.076,40 84.012,41 45.847,42 42.218,44 4.222}
{0 CHEMBL185878,1 6.326,2 32.9,3 57,4 0.995,5 1.137,6 0.609,7 0.558,8 499.79,9 1.3,11 79,13 3,14 37,16 82,17 26,20 1,21 25,22 3,24 45,25 8,26 1,28 1,29 6,31 1,32 34,35 7.6,36 0.085,37 7,38 40,39 78.581,40 89.809,41 48.131,42 44.087,44 5.215}
{0 CHEMBL193344,1 7.054,2 38.2,3 51.5,4 1.001,5 1.135,6 0.641,7 0.597,8 479.69,9 1.5,10 12,11 68,13 14,14 35,16 70,17 26,20 12,21 14,22 2,23 2,24 35,25 7,26 1,28 1,29 3,31 1,32 33,34 2,35 4.4,36 0.114,37 8,38 43,39 68.09,40 77.2,41 43.597,42 40.602,43 2.9,44 7.658}
{0 CHEMBL193439,1 7.102,2 37.8,3 50,4 1.003,5 1.129,6 0.641,7 0.603,8 695.96,9 3.1,10 18,11 98,13 22,14 52,16 101,17 37,20 19,21 18,22 4,24 49,25 12,26 1,28 3,29 8,31 1,32 49,35 8.2,36 0.168,37 17,38 65,39 98.323,40 110.64,41 62.813,42 59.086,44 8.398}
{0 CHEMBL193742,1 6.475,2 36.6,3 54.9,4 0.987,5 1.13,6 0.635,7 0.579,8 459.74,9 2.8,10 12,11 71,13 14,14 34,16 73,17 26,20 11,21 15,22 2,24 39,25 6,26 1,28 2,29 3,31 1,32 32,35 4.2,36 0.11,37 8,38 42,39 70.109,40 80.226,41 45.108,42 41.12,44 6.658}
{0 CHEMBL193765,1 6.783,2 39.2,3 51.9,4 0.989,5 1.126,6 0.652,7 0.6,8 535.82,9 3.8,10 18,11 79,13 20,14 41,16 82,17 31,20 17,21 14,22 2,24 41,25 7,26 1,28 3,29 3,31 1,32 38,35 3.8,36 0.122,37 10,38 52,39 78.152,40 88.932,41 51.495,42 47.405,44 7.284}
{0 CHEMBL193847,1 7.02,2 38.4,3 50.5,4 1.001,5 1.127,6 0.642,7 0.602,8 694.97,9 2,10 18,11 99,13 22,14 52,16 102,17 38,20 20,21 18,22 4,24 50,25 11,26 1,28 2,29 8,31 1,32 49,35 8.1,36 0.167,37 17,38 65,39 99.105,40 111.557,41 63.569,42 59.591,44 8.699}
{0 CHEMBL193868,1 6.79,2 38.2,3 52.9,4 0.994,5 1.13,6 0.642,7 0.591,8 461.7,9 1.5,10 12,11 68,13 14,14 34,16 70,17 26,20 12,21 14,22 2,23 1,24 36,25 6,26 1,28 1,29 3,31 1,32 32,34 1,35 4.4,36 0.114,37 8,38 42,39 67.578,40 76.86,41 43.66,42 40.219,43 1.5,44 6.745}
{0 CHEMBL194163,1 6.372,2 37.5,3 55.6,4 0.985,5 1.127,6 0.637,7 0.578,8 458.75,9 1.4,10 12,11 72,13 14,14 34,16 74,17 27,20 12,21 15,22 2,24 40,25 5,26 1,28 1,29 3,31 1,32 32,35 4.2,36 0.108,37 8,38 42,39 70.89,40 81.143,41 45.864,42 41.625,44 6.678}
{0 CHEMBL194188,1 6.215,2 36.1,3 56.6,4 0.984,5 1.131,6 0.628,7 0.569,8 515.86,9 2.4,10 12,11 83,13 14,14 38,16 85,17 30,20 12,21 18,22 2,24 47,25 6,26 1,28 2,29 3,31 1,32 36,35 3.6,36 0.118,37 10,38 46,39 81.643,40 93.887,41 52.154,42 47.227,44 5.056}
{0 CHEMBL194239,1 7.01,2 36.6,3 51.2,4 1.003,5 1.13,6 0.635,7 0.595,8 574.81,9 2.4,10 12,11 82,13 16,14 42,16 84,17 30,20 14,21 16,22 4,24 42,25 10,26 1,28 2,29 7,31 1,32 40,35 8.5,36 0.155,37 13,38 52,39 82.243,40 92.686,41 52.069,42 48.769,44 7.638}
{0 CHEMBL194296,1 6.869,2 38,3 52.1,4 0.996,5 1.126,6 0.643,7 0.595,8 487.72,9 1.4,10 12,11 71,13 15,14 36,16 73,17 27,20 13,21 14,22 3,24 37,25 7,26 1,28 1,29 5,31 1,32 34,35 7,36 0.11,37 8,38 45,39 70.72,40 79.939,41 45.631,42 42.265,44 5.886}
{0 CHEMBL194420,1 6.277,2 34.7,3 56.4,4 0.991,5 1.135,6 0.617,7 0.564,8 634.01,9 2,10 12,11 101,13 14,14 46,16 103,17 35,20 12,21 23,22 2,24 57,25 9,26 1,28 2,29 6,31 1,32 44,35 5.9,36 0.175,37 18,38 54,39 100.043,40 114.591,41 62.325,42 57.006,44 8.398}
{0 CHEMBL194461,1 6.662,2 37.7,3 53.6,4 0.991,5 1.127,6 0.64,7 0.588,8 459.71,9 1.4,10 12,11 69,13 14,14 34,16 71,17 26,20 12,21 14,22 2,24 37,25 6,26 1,28 1,29 4,31 1,32 32,35 5.8,36 0.113,37 8,38 42,39 68.392,40 77.73,41 44.177,42 40.55,44 8.658}
{0 CHEMBL194614,1 6.133,2 35.7,3 57.1,4 0.984,5 1.132,6 0.623,7 0.564,8 601,9 2,10 12,11 98,13 14,14 44,16 100,17 35,20 12,21 23,22 2,24 56,25 7,26 1,28 2,29 4,31 1,32 42,35 4.1,36 0.17,37 17,38 52,39 96.446,40 110.965,41 61.035,42 55.313,44 7.796}
{0 CHEMBL194685,1 6.657,2 38.8,3 52.9,4 0.989,5 1.126,6 0.645,7 0.593,8 565.87,9 2.4,10 18,11 85,13 20,14 43,16 88,17 33,20 17,21 16,22 2,24 45,25 7,26 1,28 2,29 4,31 1,32 40,35 4.7,36 0.125,37 11,38 54,39 84.087,40 95.681,41 54.847,42 50.415,44 9.125}
{0 CHEMBL194785,1 6.248,2 37.5,3 56.3,4 0.982,5 1.127,6 0.635,7 0.574,8 499.83,9 1.3,10 12,11 80,13 14,14 37,16 82,17 30,20 12,21 18,22 2,24 45,25 5,26 1,28 1,29 3,31 1,32 35,35 3.8,36 0.11,37 9,38 45,39 78.599,40 90.181,41 50.768,42 45.942,44 6}
{0 CHEMBL194792,1 6.637,2 37.3,3 53.7,4 0.989,5 1.128,6 0.641,7 0.587,8 444.7,9 3,10 12,11 67,13 14,14 33,16 69,17 25,20 11,21 14,22 2,24 36,25 6,26 1,28 2,29 3,31 1,32 31,35 4.5,36 0.116,37 8,38 41,39 66.283,40 75.603,41 42.966,42 39.33,44 8.301}
{0 CHEMBL194899,1 6.921,2 39.3,3 51.8,4 0.992,5 1.122,6 0.655,7 0.602,8 387.59,9 1.8,10 12,11 56,13 14,14 29,16 58,17 22,20 12,21 10,22 2,24 29,25 5,26 1,28 1,29 3,31 1,32 27,35 5.4,36 0.086,37 5,38 37,39 55.531,40 62.859,41 36.677,42 33.728,44 6.638}
{0 CHEMBL195012,1 6.758,2 41.1,3 51.6,4 0.988,5 1.121,6 0.657,7 0.605,8 641.97,9 2.1,10 24,11 95,13 26,14 50,16 99,17 39,20 23,21 16,22 2,24 49,25 7,26 1,28 2,29 4,31 1,32 46,35 4.2,36 0.131,37 13,38 64,39 93.854,40 106.511,41 62.37,42 57.469,44 9}
{0 CHEMBL196005,1 6.903,2 37.3,3 52,4 0.999,5 1.128,6 0.638,7 0.593,8 517.75,9 1.3,10 12,11 75,13 15,14 38,16 77,17 28,20 13,21 15,22 3,24 39,25 8,26 1,28 1,29 6,31 1,32 36,35 8,36 0.143,37 11,38 47,39 74.93,40 84.564,41 47.847,42 44.506,44 7.569}
{0 CHEMBL196029,1 6.319,2 36.1,3 55.7,4 0.987,5 1.132,6 0.628,7 0.573,8 612.99,9 3.1,10 12,11 97,13 14,14 47,16 101,17 35,20 12,21 23,22 2,24 54,25 8,26 1,28 3,29 4,31 1,32 43,35 4.1,36 0.129,37 13,38 55,39 95.723,40 109.84,41 60.898,42 55.544,44 8.398}
{0 CHEMBL196032,1 6.744,2 35.7,3 53.1,4 1,5 1.132,6 0.626,7 0.583,8 660.96,9 2,10 12,11 98,13 16,14 48,16 100,17 35,20 14,21 21,22 4,24 52,25 11,26 1,28 2,29 8,31 1,32 46,35 8.2,36 0.19,37 19,38 58,39 97.988,40 110.972,41 61.33,42 57.118,44 8.638}
{0 CHEMBL196037,1 7.01,2 39.1,3 51.6,4 0.999,5 1.127,6 0.646,7 0.6,8 448.65,10 12,11 64,13 14,14 33,16 66,17 25,20 12,21 13,22 2,23 1,24 33,25 6,26 1,29 4,31 1,32 31,34 1,35 6.3,36 0.121,37 8,38 41,39 63.92,40 72.156,41 41.347,42 38.385,43 1.6,44 7.301}
{0 CHEMBL196159,1 6.803,2 37.5,3 54.2,4 0.986,5 1.123,6 0.655,7 0.591,8 489.81,9 1.4,10 12,11 72,13 14,14 35,16 74,17 27,20 12,21 15,22 2,24 39,25 6,26 2,28 1,29 3,31 2,32 33,35 4.2,36 0.122,37 9,38 43,39 71.025,40 80.855,41 47.131,42 42.549,44 7.377}
{0 CHEMBL196242,1 6.246,2 36.5,3 56.5,4 0.985,5 1.13,6 0.628,7 0.57,8 530.87,9 1.2,10 12,11 85,13 14,14 39,16 87,17 31,20 12,21 19,22 2,24 48,25 6,26 1,28 1,29 4,31 1,32 37,35 4.7,36 0.149,37 13,38 47,39 83.752,40 96.013,41 53.364,42 48.447,44 4.678}
{0 CHEMBL196243,1 6.79,2 38.2,3 52.9,4 0.994,5 1.13,6 0.642,7 0.591,8 461.7,9 1.5,10 12,11 68,13 14,14 34,16 70,17 26,20 12,21 14,22 2,23 1,24 36,25 6,26 1,28 1,29 3,31 1,32 32,34 1,35 4.4,36 0.114,37 8,38 42,39 67.578,40 76.86,41 43.66,42 40.219,43 1.5,44 8}
{0 CHEMBL196280,1 6.59,2 38.6,3 53.4,4 0.988,5 1.126,6 0.643,7 0.59,8 579.9,9 2.3,10 18,11 88,13 20,14 44,16 91,17 34,20 17,21 17,22 2,24 47,25 7,26 1,28 2,29 4,31 1,32 41,35 4.5,36 0.132,37 12,38 55,39 86.97,40 99.096,41 56.609,42 51.942,44 8.222}
{0 CHEMBL196313,1 6.348,2 38.6,3 55.4,4 0.984,5 1.124,6 0.638,7 0.58,8 526.85,10 12,11 83,13 15,14 39,16 85,17 32,20 14,21 18,22 3,24 46,25 5,26 1,29 4,31 1,32 37,35 4.8,36 0.176,37 15,38 48,39 81.708,40 93.307,41 52.978,42 48.163,44 4.796}
{0 CHEMBL196314,1 7.081,2 38.6,3 50.9,4 0.998,5 1.124,6 0.651,7 0.604,8 403.59,9 1.8,10 12,11 57,13 14,14 30,16 59,17 22,20 12,21 10,22 2,24 29,25 6,26 1,28 1,29 4,31 1,32 28,35 7,36 0.102,37 6,38 38,39 56.858,40 64.069,41 37.131,42 34.443,44 6.585}
{0 CHEMBL196443,1 6.78,2 37.8,3 52.7,4 0.995,5 1.126,6 0.64,7 0.592,8 501.75,9 1.4,10 12,11 74,13 15,14 37,16 76,17 28,20 13,21 15,22 3,24 39,25 7,26 1,28 1,29 5,31 1,32 35,35 6.8,36 0.132,37 10,38 46,39 73.603,40 83.354,41 47.392,42 43.792,44 8.155}
{0 CHEMBL196459,1 6.83,2 37.5,3 52.8,4 0.997,5 1.132,6 0.637,7 0.59,8 491.73,9 1.4,10 12,11 72,13 14,14 36,16 74,17 27,20 12,21 15,22 2,23 1,24 38,25 7,26 1,28 1,29 4,31 1,32 34,34 1,35 5.6,36 0.122,37 9,38 44,39 71.789,40 81.484,41 45.875,42 42.46,43 1.4,44 8.444}
{0 CHEMBL196475,1 6.919,2 36.9,3 53.8,4 0.989,5 1.123,6 0.656,7 0.592,8 449.74,9 1.5,10 11,11 65,13 13,14 32,16 67,17 24,20 10,21 14,22 2,24 35,25 6,26 2,28 1,29 3,31 2,32 30,35 4.6,36 0.119,37 8,38 39.5,39 64.258,40 73.025,41 42.608,42 38.496,44 8.301}
{0 CHEMBL196482,1 7.529,2 39.7,3 50,4 0.998,5 1.121,6 0.673,7 0.617,8 436.66,10 12,11 58,13 14,14 31,16 60,17 23,20 12,21 11,22 2,23 1,24 29,25 6,26 2,29 3,31 2,32 29,34 1,35 5.2,36 0.1,37 6,38 39,39 57.901,40 65.036,41 39.017,42 35.804,43 1.7,44 7.721}
{0 CHEMBL196520,1 7.533,2 40.9,3 47.7,4 1,5 1.118,6 0.673,7 0.628,8 331.47,9 2.3,10 12,11 44,13 14,14 25,16 46,17 18,20 12,21 6,22 2,24 21,25 5,26 1,28 1,29 3,31 1,32 23,35 6.8,36 0.022,37 1,38 33,39 43.996,40 49.199,41 29.631,42 27.621,44 4.301}
{0 CHEMBL196555,1 7.04,2 42.6,3 50,4 0.991,5 1.115,6 0.668,7 0.618,8 478.7,10 18,11 68,13 20,14 37,16 71,17 29,20 18,21 11,22 2,24 34,25 5,26 1,29 4,31 1,32 34,35 5.9,36 0.099,37 7,38 48,39 67.407,40 75.816,41 45.409,42 42.002,44 6.745}
{0 CHEMBL196658,1 6.58,2 37.5,3 54.2,4 0.99,5 1.127,6 0.638,7 0.584,8 473.74,9 1.4,10 12,11 72,13 14,14 35,16 74,17 27,20 12,21 15,22 2,24 39,25 6,26 1,28 1,29 4,31 1,32 33,35 5.6,36 0.122,37 9,38 43,39 71.276,40 81.145,41 45.938,42 42.077,44 7.959}
{0 CHEMBL196788,1 9.307,2 40,3 50,4 0.994,5 1.115,6 0.698,7 0.63,8 558.41,10 12,11 60,13 14,14 32,15 2,16 62,17 24,20 12,21 12,22 2,24 30,25 6,26 3,29 3,31 1,32 30,34 2,35 5,36 0.113,37 7,38 40,39 59.654,40 66.875,41 41.898,42 37.811,43 3.3,44 6.26}
{0 CHEMBL197152,1 6.525,2 38.2,3 54.4,4 0.986,5 1.125,6 0.643,7 0.586,8 443.71,9 1.5,10 12,11 68,13 14,14 33,16 70,17 26,20 12,21 14,22 2,24 37,25 5,26 1,28 1,29 3,31 1,32 31,35 4.4,36 0.114,37 8,38 41,39 67.065,40 76.52,41 43.722,42 39.835,44 7.886}
{0 CHEMBL197260,1 8.302,2 39.7,3 50,4 0.998,5 1.118,6 0.677,7 0.62,8 481.49,10 12,11 58,13 14,14 31,15 1,16 60,17 23,20 12,21 11,22 2,24 29,25 6,26 2,29 4,31 1,32 29,34 1,35 6.9,36 0.1,37 6,38 39,39 57.869,40 64.827,41 39.239,42 35.973,43 1.7,44 7.155}
{0 CHEMBL197271,1 6.58,2 37.5,3 54.2,4 0.99,5 1.127,6 0.638,7 0.584,8 473.74,9 1.4,10 12,11 72,13 14,14 35,16 74,17 27,20 12,21 15,22 2,24 39,25 6,26 1,28 1,29 4,31 1,32 33,35 5.6,36 0.122,37 9,38 43,39 71.276,40 81.145,41 45.938,42 42.077,44 7.959}
{0 CHEMBL197311,1 6.58,2 37.5,3 54.2,4 0.99,5 1.127,6 0.638,7 0.584,8 473.74,9 1.4,10 12,11 72,13 14,14 35,16 74,17 27,20 12,21 15,22 2,24 39,25 6,26 1,28 1,29 4,31 1,32 33,35 5.6,36 0.122,37 9,38 43,39 71.276,40 81.145,41 45.938,42 42.077,44 8.347}
{0 CHEMBL197341,1 6.677,2 39.1,3 53.6,4 0.991,5 1.127,6 0.644,7 0.59,8 460.71,10 12,11 69,13 14,14 34,16 71,17 27,20 12,21 15,22 2,23 1,24 37,25 5,26 1,29 3,31 1,32 32,34 1,35 4.3,36 0.127,37 9,38 42,39 68.359,40 77.777,41 44.415,42 40.724,43 1.4,44 6.498}
{0 CHEMBL197506,1 7.277,2 40,3 50,4 1.004,5 1.131,6 0.651,7 0.609,8 436.61,10 12,11 60,13 14,14 32,16 62,17 24,20 12,21 12,22 2,23 2,24 30,25 6,26 1,29 3,31 1,32 30,34 2,35 5,36 0.113,37 7,38 40,39 60.221,40 67.871,41 39.069,42 36.527,43 3.3,44 6.745}
{0 CHEMBL197508,1 6.553,2 37.1,3 54.3,4 0.988,5 1.129,6 0.639,7 0.584,8 458.73,9 2.9,10 12,11 70,13 14,14 34,16 72,17 26,20 12,21 14,22 2,24 38,25 6,26 1,28 2,29 3,31 1,32 32,35 4.3,36 0.111,37 8,38 42,39 69.167,40 79.018,41 44.728,42 40.857,44 8.699}
{0 CHEMBL197639,1 6.704,2 38.7,3 53.2,4 0.989,5 1.124,6 0.648,7 0.593,8 415.65,9 1.6,10 12,11 62,13 14,14 31,16 64,17 24,20 12,21 12,22 2,24 33,25 5,26 1,28 1,29 3,31 1,32 29,35 4.8,36 0.094,37 6,38 39,39 61.298,40 69.69,41 40.199,42 36.782,44 8.301}
{0 CHEMBL197838,1 7.511,2 37.1,3 50,4 1.002,5 1.123,6 0.661,7 0.611,8 465.69,9 1.6,10 12,11 62,13 16,14 33,16 64,17 23,20 12,21 11,22 4,24 31,25 8,26 2,28 1,29 5,31 2,32 31,35 8.1,36 0.109,37 7,38 43,39 62.145,40 69.613,41 40.995,42 37.872,44 6.222}
{0 CHEMBL197938,1 7.043,2 39.3,3 50.8,4 0.996,5 1.123,6 0.654,7 0.606,8 429.63,9 1.6,10 12,11 61,13 15,14 32,16 63,17 24,20 13,21 11,22 3,24 31,25 6,26 1,28 1,29 4,31 1,32 30,35 6.6,36 0.095,37 6,38 41,39 60.741,40 68.484,41 39.892,42 36.97,44 7.046}
{0 CHEMBL197995,1 6.47,2 35.6,3 55.2,4 0.993,5 1.131,6 0.624,7 0.573,8 562.87,9 1.1,10 12,11 87,13 14,14 41,16 89,17 31,20 12,21 19,22 2,24 48,25 8,26 1,28 1,29 6,31 1,32 39,35 6.9,36 0.169,37 15,38 49,39 86.407,40 98.432,41 54.273,42 49.877,44 4.745}
{0 CHEMBL198283,1 6.729,2 39.1,3 53.1,4 0.991,5 1.122,6 0.647,7 0.594,8 430.66,10 12,11 64,13 14,14 32,16 66,17 25,20 12,21 13,22 2,24 34,25 5,26 1,29 4,31 1,32 30,35 6.3,36 0.121,37 8,38 40,39 63.407,40 71.816,41 41.409,42 38.002,44 6.721}
{0 CHEMBL198284,1 7.049,2 41,3 50,4 0.995,5 1.12,6 0.659,7 0.613,8 549.79,9 1.3,10 18,11 78,13 21,14 42,16 81,17 32,20 19,21 13,22 3,24 39,25 7,26 1,28 1,29 5,31 1,32 39,35 6.4,36 0.136,37 11,38 54,39 77.603,40 87.354,41 51.392,42 47.792,44 6.222}
{0 CHEMBL199148,1 6.215,2 36.1,3 56.6,4 0.984,5 1.131,6 0.628,7 0.569,8 515.86,9 2.4,10 12,11 83,13 14,14 38,16 85,17 30,20 12,21 18,22 2,24 47,25 6,26 1,28 2,29 3,31 1,32 36,35 3.6,36 0.118,37 10,38 46,39 81.643,40 93.887,41 52.154,42 47.227,44 7.174}
{0 CHEMBL199278,1 6.996,2 37.5,3 51.4,4 1.001,5 1.127,6 0.64,7 0.597,8 503.72,9 1.4,10 12,11 72,13 15,14 37,16 74,17 27,20 13,21 14,22 3,24 37,25 8,26 1,28 1,29 6,31 1,32 35,35 8.3,36 0.108,37 8,38 46,39 72.047,40 81.148,41 46.086,42 42.98,44 5.573}
{0 CHEMBL2074579,1 5.996,2 34.7,3 57.3,4 0.991,5 1.137,6 0.604,7 0.555,8 449.7,9 1.3,11 75,13 2,14 35,16 78,17 26,20 2,21 24,22 2,24 43,25 6,28 1,29 5,32 32,35 6.7,36 0.077,37 6,38 37,39 74.294,40 85.265,41 45.268,42 41.658,44 5.244}
{0 CHEMBL2074643,1 5.774,2 35.3,3 58.8,4 0.985,5 1.134,6 0.604,7 0.55,8 392.64,11 68,13 1,14 31,16 71,17 24,20 1,21 23,22 1,24 40,25 4,29 4,32 28,35 5.9,36 0.056,37 4,38 32,39 66.981,40 77.142,41 41.046,42 37.395,44 5.481}
{0 CHEMBL2074988,1 6.876,2 40.4,3 51.9,4 0.987,5 1.12,6 0.663,7 0.606,8 357.56,9 1.9,10 12,11 52,13 14,14 27,16 54,17 21,20 12,21 9,22 2,24 27,25 4,26 1,28 1,29 2,31 1,32 25,35 3.8,36 0.093,37 5,38 35,39 51.32,40 58.235,41 34.461,42 31.487,44 5}
{0 CHEMBL224867,1 6.447,2 32.5,3 56.3,4 0.999,5 1.138,6 0.607,7 0.56,8 515.79,9 1.3,11 80,13 3,14 38,16 83,17 26,20 1,21 25,22 3,24 45,25 9,26 1,28 1,29 7,31 1,32 35,35 8.8,36 0.084,37 7,38 41,39 79.909,40 91.019,41 48.586,42 44.802,44 4.478}
{0 CHEMBL258605,1 5.996,2 34.7,3 57.3,4 0.991,5 1.137,6 0.604,7 0.555,8 449.7,9 1.3,11 75,13 2,14 35,16 78,17 26,20 2,21 24,22 2,24 43,25 6,28 1,29 5,32 32,35 6.7,36 0.077,37 6,38 37,39 74.294,40 85.265,41 45.268,42 41.658,44 5.699}
{0 CHEMBL263577,1 7.065,2 40,3 50.9,4 0.996,5 1.119,6 0.657,7 0.608,8 388.57,10 12,11 55,13 14,14 29,16 57,17 22,20 12,21 10,22 2,24 28,25 5,26 1,29 4,31 1,32 27,35 7.3,36 0.088,37 5,38 37,39 54.756,40 61.57,41 36.125,42 33.422,44 7.046}
{0 CHEMBL272427,1 6.326,2 32.9,3 57,4 0.995,5 1.137,6 0.609,7 0.558,8 499.79,9 1.3,11 79,13 3,14 37,16 82,17 26,20 1,21 25,22 3,24 45,25 8,26 1,28 1,29 6,31 1,32 34,35 7.6,36 0.085,37 7,38 40,39 78.581,40 89.809,41 48.131,42 44.087,44 4.553}
{0 CHEMBL331015,1 6.286,2 34.7,3 56.1,4 0.988,5 1.136,6 0.621,7 0.567,8 616,9 4.1,10 12,11 98,13 15,14 45,16 100,17 34,20 13,21 21,22 3,24 55,25 9,26 1,28 4,29 4,31 1,32 43,35 4.1,36 0.14,37 14,38 54,39 96.825,40 111.338,41 60.904,42 55.565,44 6.495}
{0 CHEMBL331235,1 6.996,2 36.1,3 51.4,4 1.001,5 1.132,6 0.637,7 0.594,8 503.73,9 4.2,10 12,11 72,13 16,14 37,16 74,17 26,20 12,21 14,22 4,24 37,25 9,26 1,28 3,29 5,31 1,32 35,35 6.9,36 0.122,37 9,38 47,39 72.04,40 81.52,41 45.881,42 42.781,44 5.921}
{0 CHEMBL331631,1 6.58,2 36.1,3 54.2,4 0.99,5 1.132,6 0.635,7 0.582,8 473.75,9 4.2,10 12,11 72,13 14,14 35,16 74,17 26,20 12,21 14,22 2,24 39,25 7,26 1,28 3,29 3,31 1,32 33,35 4.2,36 0.108,37 8,38 43,39 71.269,40 81.517,41 45.733,42 41.878,44 6.495}
{0 CHEMBL331910,1 6.624,2 36.6,3 53.5,4 0.994,5 1.131,6 0.632,7 0.584,8 669.01,9 3,10 18,11 101,13 20,14 50,16 104,17 37,20 17,21 20,22 2,24 54,25 10,26 1,28 3,29 6,31 1,32 47,35 5.9,36 0.173,37 18,38 61,39 100.377,40 114.259,41 63.807,42 58.973,44 6.509}
{0 CHEMBL332370,1 6.96,2 38.3,3 51.7,4 0.996,5 1.125,6 0.648,7 0.599,8 417.62,9 1.7,10 12,11 60,13 14,14 31,16 62,17 23,20 12,21 11,22 2,24 31,25 6,26 1,28 1,29 4,31 1,32 29,35 6.7,36 0.113,37 7,38 39,39 59.741,40 67.484,41 38.892,42 35.97,44 7.319}
{0 CHEMBL332606,1 6.567,2 38.6,3 53.4,4 0.986,5 1.127,6 0.645,7 0.591,8 577.91,9 3.4,10 18,11 88,13 20,14 44,16 91,17 34,20 18,21 16,22 2,24 47,25 7,26 1,28 3,29 3,31 1,32 41,35 3.4,36 0.132,37 12,38 55,39 86.803,40 99.178,41 56.779,42 51.985,44 5.602}
{0 CHEMBL332973,1 6.212,2 33.9,3 56.9,4 0.99,5 1.137,6 0.613,7 0.56,8 677.09,9 2.8,10 12,11 109,13 14,14 49,16 111,17 37,20 12,21 25,22 2,24 62,25 10,26 1,28 3,29 6,31 1,32 47,35 5.5,36 0.189,37 21,38 57,39 107.912,40 123.92,41 66.853,42 61.081,44 8.523}
{0 CHEMBL332974,1 6.193,2 34.6,3 56.7,4 0.986,5 1.136,6 0.619,7 0.564,8 644.06,9 3.8,10 12,11 104,13 15,14 47,16 106,17 36,20 13,21 23,22 3,24 59,25 9,26 1,28 4,29 4,31 1,32 45,35 3.8,36 0.16,37 17,38 56,39 102.592,40 118.169,41 64.427,42 58.619,44 8.796}
{0 CHEMBL333922,1 7.071,2 39,3 50,4 0.998,5 1.126,6 0.651,7 0.608,8 579.83,9 3.7,10 18,11 82,13 22,14 44,16 85,17 32,20 18,21 14,22 4,24 41,25 9,26 1,28 3,29 5,31 1,32 41,35 6.1,36 0.129,37 11,38 57,39 81.807,40 92.351,41 53.404,42 49.834,44 6}
{0 CHEMBL340291,1 7.503,2 36.1,3 53,4 0.994,5 1.13,6 0.648,7 0.593,8 622.74,9 3.6,10 12,11 83,13 15,14 41,15 1,16 85,17 30,20 13,21 17,22 3,24 44,25 9,26 2,28 3,29 4,31 1,32 39,34 1,35 4.8,36 0.141,37 12,38 50,39 82.476,40 93.813,41 53.824,42 49.198,43 1.2,44 7.658}
{0 CHEMBL341082,1 6.637,2 37.3,3 53.7,4 0.989,5 1.128,6 0.641,7 0.587,8 444.7,9 3,10 12,11 67,13 14,14 33,16 69,17 25,20 12,21 13,22 2,24 36,25 6,26 1,28 2,29 3,31 1,32 31,35 4.5,36 0.116,37 8,38 41,39 66.283,40 75.603,41 42.966,42 39.33,44 7.456}
{0 CHEMBL341104,1 6.775,2 36.8,3 52.9,4 0.994,5 1.13,6 0.639,7 0.589,8 460.7,9 2.9,10 12,11 68,13 14,14 34,16 70,17 25,20 12,21 13,22 2,24 36,25 7,26 1,28 2,29 4,31 1,32 32,35 5.9,36 0.114,37 8,38 42,39 67.61,40 76.813,41 43.421,42 40.045,44 8.097}
{0 CHEMBL363392,1 6.491,2 38.5,3 53.8,4 0.987,5 1.127,6 0.641,7 0.587,8 675.06,9 2.9,10 18,11 104,13 20,14 53,16 109,17 40,20 18,21 22,22 2,24 56,25 8,26 1,28 3,29 4,31 1,32 48,35 3.8,36 0.119,37 13,38 64,39 102.606,40 117.255,41 66.66,42 61.071,44 9.553}
{0 CHEMBL364224,1 6.282,2 35,3 56.3,4 0.99,5 1.134,6 0.618,7 0.566,8 647.03,9 1.9,10 12,11 103,13 14,14 47,16 105,17 36,20 12,21 24,22 2,24 58,25 9,26 1,28 2,29 6,31 1,32 45,35 5.8,36 0.19,37 20,38 55,39 101.985,40 116.799,41 63.705,42 58.269,44 7.523}
{0 CHEMBL364658,1 6.78,2 37.8,3 52.7,4 0.995,5 1.126,6 0.64,7 0.592,8 501.75,9 1.4,10 12,11 74,13 15,14 37,16 76,17 28,20 13,21 15,22 3,24 39,25 7,26 1,28 1,29 5,31 1,32 35,35 6.8,36 0.132,37 10,38 46,39 73.603,40 83.354,41 47.392,42 43.792,44 7.387}
{0 CHEMBL364676,1 6.224,2 35.9,3 56.3,4 0.985,5 1.133,6 0.625,7 0.569,8 641.05,9 2.9,10 12,11 103,13 14,14 49,16 107,17 37,20 12,21 25,22 2,24 58,25 8,26 1,28 3,29 4,31 1,32 45,35 3.9,36 0.14,37 15,38 57,39 101.49,40 116.671,41 64.421,42 58.597,44 9.301}
{0 CHEMBL364886,1 6.965,2 39.4,3 51.5,4 0.995,5 1.128,6 0.65,7 0.601,8 459.68,9 1.5,10 12,11 66,13 14,14 35,16 69,17 26,20 12,21 14,22 2,23 1,24 34,25 6,26 1,28 1,29 3,31 1,32 32,34 1,35 4.5,36 0.087,37 6,38 43,39 65.694,40 74.445,41 42.898,42 39.692,43 1.5,44 7.229}
{0 CHEMBL367757,1 6.385,2 38.6,3 53.4,4 0.989,5 1.13,6 0.632,7 0.585,8 561.84,9 3.4,10 11,11 88,13 13,14 46,16 93,17 34,20 11,21 23,22 2,24 47,25 7,28 3,29 4,32 41,35 4.5,36 0.086,37 8,38 53.5,39 87.054,40 99.467,41 55.586,42 51.513,44 6.046}
{0 CHEMBL369912,1 6.941,2 39.7,3 51.7,4 0.994,5 1.12,6 0.653,7 0.603,8 402.6,10 12,11 58,13 14,14 30,16 60,17 23,20 12,21 11,22 2,24 30,25 5,26 1,29 4,31 1,32 28,35 6.9,36 0.1,37 6,38 38,39 57.64,40 64.986,41 37.887,42 34.948,44 6.921}
{0 CHEMBL370102,1 6.673,2 40.5,3 52.7,4 0.986,5 1.121,6 0.655,7 0.599,8 493.77,9 1.4,10 17,11 74,13 19,14 38,16 77,17 30,20 16,21 14,22 2,24 39,25 5,26 1,28 1,29 3,31 1,32 35,35 4.1,36 0.104,37 8,38 48.5,39 72.949,40 82.935,41 48.483,42 44.362,44 6.208}
{0 CHEMBL370103,1 6.914,2 36.1,3 51.8,4 1,5 1.132,6 0.634,7 0.591,8 573.83,9 3.6,10 12,11 83,13 16,14 42,16 85,17 30,20 14,21 16,22 4,24 43,25 10,26 1,28 3,29 6,31 1,32 40,35 7.2,36 0.153,37 13,38 52,39 83.018,40 93.975,41 52.62,42 49.076,44 9.523}
{0 CHEMBL370572,1 6.919,2 36.9,3 53.8,4 0.989,5 1.123,6 0.656,7 0.592,8 449.74,9 1.5,10 11,11 65,13 13,14 32,16 67,17 24,20 10,21 14,22 2,24 35,25 6,26 2,28 1,29 3,31 2,32 30,35 4.6,36 0.119,37 8,38 39.5,39 64.258,40 73.025,41 42.608,42 38.496,44 7.523}
{0 CHEMBL370585,1 6.637,2 37.3,3 53.7,4 0.989,5 1.128,6 0.641,7 0.587,8 444.7,9 3,10 12,11 67,13 14,14 33,16 69,17 25,20 11,21 14,22 2,24 36,25 6,26 1,28 2,29 3,31 1,32 31,35 4.5,36 0.116,37 8,38 41,39 66.283,40 75.603,41 42.966,42 39.33,44 8.097}
{0 CHEMBL370717,1 6.715,2 39.7,3 52.6,4 0.989,5 1.123,6 0.65,7 0.597,8 523.8,9 1.3,10 17,11 78,13 19,14 40,16 81,17 31,20 16,21 15,22 2,24 41,25 6,26 1,28 1,29 4,31 1,32 37,35 5.1,36 0.111,37 9,38 50.5,39 77.159,40 87.56,41 50.699,42 46.604,44 7.125}
{0 CHEMBL370737,1 7.098,2 40.4,3 50.9,4 0.997,5 1.125,6 0.656,7 0.607,8 404.59,10 12,11 57,13 14,14 30,16 59,17 23,20 12,21 11,22 2,23 1,24 29,25 5,26 1,29 3,31 1,32 28,34 1,35 5.3,36 0.085,37 5,38 38,39 56.825,40 64.116,41 37.37,42 34.617,43 1.8,44 7.678}
{0 CHEMBL370819,1 6.526,2 37.9,3 54.5,4 0.987,5 1.126,6 0.642,7 0.584,8 430.69,9 1.5,10 12,11 66,13 14,14 32,16 68,17 25,20 12,21 13,22 2,24 36,25 5,26 1,28 1,29 3,31 1,32 30,35 4.5,36 0.088,37 6,38 40,39 65.123,40 74.313,41 42.341,42 38.572,44 7.081}
{0 CHEMBL370886,1 6.339,2 36.7,3 55.7,4 0.985,5 1.13,6 0.633,7 0.575,8 500.82,9 2.5,10 12,11 79,13 14,14 37,16 81,17 29,20 12,21 17,22 2,24 44,25 6,26 1,28 2,29 3,31 1,32 35,35 3.8,36 0.123,37 10,38 45,39 77.818,40 89.264,41 50.012,42 45.437,44 7.328}
{0 CHEMBL370936,1 7.246,2 41.7,3 48.6,4 0.998,5 1.118,6 0.665,7 0.621,8 521.73,9 1.4,10 18,11 72,13 21,14 40,16 75,17 30,20 19,21 11,22 3,24 35,25 7,26 1,28 1,29 5,31 1,32 37,35 6.9,36 0.12,37 9,38 52,39 71.836,40 80.524,41 47.87,42 44.738,44 6.398}
{0 CHEMBL371033,1 6.662,2 37.7,3 53.6,4 0.991,5 1.127,6 0.64,7 0.588,8 459.71,9 1.4,10 12,11 69,13 14,14 34,16 71,17 26,20 12,21 14,22 2,24 37,25 6,26 1,28 1,29 4,31 1,32 32,35 5.8,36 0.113,37 8,38 42,39 68.392,40 77.73,41 44.177,42 40.55,44 8.137}
{0 CHEMBL371075,1 6.467,2 34.3,3 55.2,4 0.997,5 1.135,6 0.615,7 0.569,8 679.03,9 1.9,10 12,11 105,13 14,14 49,16 107,17 36,20 12,21 24,22 2,24 58,25 11,26 1,28 2,29 8,31 1,32 47,35 7.6,36 0.206,37 22,38 57,39 104.639,40 119.217,41 64.614,42 59.699,44 8.046}
{0 CHEMBL371511,1 7.191,2 40,3 50,4 0.995,5 1.121,6 0.663,7 0.613,8 359.53,9 2,10 12,11 50,13 14,14 27,16 52,17 20,20 12,21 8,22 2,24 25,25 5,26 1,28 1,29 3,31 1,32 25,35 6,36 0.058,37 3,38 35,39 49.763,40 56.029,41 33.154,42 30.675,44 5.398}
{0 CHEMBL371528,1 6.744,2 41.3,3 52,4 0.986,5 1.119,6 0.66,7 0.605,8 505.78,9 1.3,10 18,11 75,13 20,14 39,16 78,17 31,20 18,21 13,22 2,24 39,25 5,26 1,28 1,29 3,31 1,32 36,35 4,36 0.128,37 10,38 50,39 73.949,40 83.935,41 49.483,42 45.362,44 5.721}
{0 CHEMBL371674,1 6.921,2 39.3,3 51.8,4 0.992,5 1.122,6 0.655,7 0.602,8 387.59,9 1.8,10 12,11 56,13 14,14 29,16 58,17 22,20 12,21 10,22 2,24 29,25 5,26 1,28 1,29 3,31 1,32 27,35 5.4,36 0.086,37 5,38 37,39 55.531,40 62.859,41 36.677,42 33.728,44 7.167}
{0 CHEMBL371847,1 6.396,2 36.1,3 55.4,4 0.988,5 1.131,6 0.629,7 0.574,8 530.85,9 2.4,10 12,11 83,13 14,14 39,16 85,17 30,20 12,21 18,22 2,24 46,25 7,26 1,28 2,29 4,31 1,32 37,35 4.8,36 0.141,37 12,38 47,39 82.028,40 93.889,41 52.228,42 47.679,44 6.469}
{0 CHEMBL371989,1 6.867,2 39.7,3 52.4,4 0.994,5 1.126,6 0.649,7 0.598,8 432.65,10 12,11 63,13 14,14 32,16 65,17 25,20 12,21 13,22 2,23 1,24 33,25 5,26 1,29 3,31 1,32 30,34 1,35 4.8,36 0.108,37 7,38 40,39 62.592,40 70.946,41 40.892,42 37.67,43 1.6,44 7.337}
{0 CHEMBL372080,1 6.27,2 36,3 56,4 0.986,5 1.133,6 0.627,7 0.571,8 627.02,9 3,10 12,11 100,13 14,14 48,16 104,17 36,20 12,21 24,22 2,24 56,25 8,26 1,28 3,29 4,31 1,32 44,35 4,36 0.135,37 14,38 56,39 98.606,40 113.255,41 62.66,42 57.071,44 9}
{0 CHEMBL372088,1 6.665,2 36.9,3 53.6,4 0.995,5 1.129,6 0.633,7 0.584,8 559.84,9 1.2,10 12,11 84,13 15,14 41,16 86,17 31,20 13,21 18,22 3,24 45,25 8,26 1,28 1,29 6,31 1,32 39,35 7.1,36 0.163,37 14,38 50,39 83.581,40 94.809,41 53.131,42 49.087,44 8.071}
{0 CHEMBL372275,1 6.629,2 36.8,3 53.9,4 0.993,5 1.129,6 0.634,7 0.583,8 503.77,9 1.3,10 12,11 76,13 14,14 37,16 78,17 28,20 12,21 16,22 2,24 41,25 7,26 1,28 1,29 5,31 1,32 35,35 6.6,36 0.128,37 10,38 45,39 75.487,40 85.769,41 48.154,42 44.318,44 8.699}
{0 CHEMBL372324,1 6.637,2 38.6,3 53,4 0.988,5 1.127,6 0.646,7 0.593,8 550.86,9 3.6,10 18,11 83,13 20,14 42,16 86,17 32,20 17,21 15,22 2,24 44,25 7,26 1,28 3,29 3,31 1,32 39,35 3.6,36 0.116,37 10,38 53,39 81.978,40 93.555,41 53.637,42 49.195,44 8.699}
{0 CHEMBL372426,1 6.629,2 36.8,3 53.9,4 0.993,5 1.129,6 0.634,7 0.583,8 503.77,9 1.3,10 12,11 76,13 14,14 37,16 78,17 28,20 12,21 16,22 2,24 41,25 7,26 1,28 1,29 5,31 1,32 35,35 6.6,36 0.128,37 10,38 45,39 75.487,40 85.769,41 48.154,42 44.318,44 7.699}
{0 CHEMBL372430,1 6.375,2 37.8,3 55.4,4 0.984,5 1.126,6 0.638,7 0.58,8 471.77,9 1.4,10 12,11 74,13 14,14 35,16 76,17 28,20 12,21 16,22 2,24 41,25 5,26 1,28 1,29 3,31 1,32 33,35 4.1,36 0.145,37 11,38 43,39 72.832,40 83.351,41 47.245,42 42.889,44 5.777}
{0 CHEMBL372572,1 6.28,2 36,3 56.2,4 0.986,5 1.132,6 0.626,7 0.57,8 558.91,9 2.2,10 12,11 89,13 14,14 41,16 91,17 32,20 12,21 20,22 2,24 50,25 7,26 1,28 2,29 4,31 1,32 39,35 4.5,36 0.154,37 14,38 49,39 87.796,40 100.719,41 55.751,42 50.732,44 7.347}
{0 CHEMBL372620,1 6.941,2 39.7,3 51.7,4 0.994,5 1.12,6 0.653,7 0.603,8 402.6,10 12,11 58,13 14,14 30,16 60,17 23,20 12,21 11,22 2,24 30,25 5,26 1,29 4,31 1,32 28,35 6.9,36 0.1,37 6,38 38,39 57.64,40 64.986,41 37.887,42 34.948,44 7.26}
{0 CHEMBL372741,1 6.615,2 39.5,3 53.1,4 0.986,5 1.124,6 0.65,7 0.595,8 535.84,9 2.5,10 18,11 81,13 20,14 41,16 84,17 32,20 17,21 15,22 2,24 43,25 6,26 1,28 2,29 3,31 1,32 38,35 3.7,36 0.119,37 10,38 52,39 79.876,40 91.056,41 52.631,42 48.174,44 6.071}
{0 CHEMBL372742,1 6.704,2 38.7,3 53.2,4 0.989,5 1.124,6 0.648,7 0.593,8 415.65,9 1.6,10 12,11 62,13 14,14 31,16 64,17 24,20 12,21 12,22 2,24 33,25 5,26 1,28 1,29 3,31 1,32 29,35 4.8,36 0.109,37 7,38 39,39 61.298,40 69.69,41 40.199,42 36.782,44 7.268}
{0 CHEMBL373284,1 6.654,2 38.4,3 53.4,4 0.99,5 1.125,6 0.643,7 0.59,8 485.75,9 1.4,10 12,11 73,13 15,14 36,16 75,17 28,20 13,21 15,22 3,24 39,25 6,26 1,28 1,29 4,31 1,32 34,35 5.5,36 0.133,37 10,38 45,39 72.276,40 82.145,41 46.938,42 43.077,44 6.523}
{0 CHEMBL380601,1 6.362,2 35.2,3 55.6,4 0.991,5 1.134,6 0.621,7 0.57,8 687.08,9 2.8,10 12,11 108,13 14,14 52,16 112,17 38,20 12,21 26,22 2,24 60,25 10,26 1,28 3,29 6,31 1,32 48,35 5.6,36 0.161,37 18,38 60,39 107.028,40 122.505,41 67.092,42 61.554,44 8.398}
{0 CHEMBL380789,1 6.8,2 39.5,3 51.9,4 0.991,5 1.124,6 0.651,7 0.6,8 550.83,9 2.5,10 18,11 81,13 20,14 42,16 84,17 32,20 17,21 15,22 2,24 42,25 7,26 1,28 2,29 4,31 1,32 39,35 4.9,36 0.131,37 11,38 53,39 80.261,40 91.058,41 52.705,42 48.625,44 7.553}
{0 CHEMBL381428,1 6.899,2 40.7,3 51.9,4 0.989,5 1.118,6 0.661,7 0.606,8 372.57,10 12,11 54,13 14,14 28,16 56,17 22,20 12,21 10,22 2,24 28,25 4,26 1,29 3,31 1,32 26,35 5.6,36 0.089,37 5,38 36,39 53.429,40 60.361,41 35.671,42 32.707,44 5.319}
{0 CHEMBL381640,1 6.525,2 38.2,3 54.4,4 0.986,5 1.125,6 0.643,7 0.586,8 443.71,9 1.5,10 12,11 68,13 14,14 33,16 70,17 26,20 12,21 14,22 2,24 37,25 5,26 1,28 1,29 3,31 1,32 31,35 4.4,36 0.114,37 8,38 41,39 67.065,40 76.52,41 43.722,42 39.835,44 6.921}
{0 CHEMBL382063,1 6.869,2 38,3 52.1,4 0.996,5 1.126,6 0.643,7 0.595,8 487.72,9 1.4,10 12,11 71,13 15,14 36,16 73,17 27,20 13,21 14,22 3,24 37,25 7,26 1,28 1,29 5,31 1,32 34,35 7,36 0.123,37 9,38 45,39 70.72,40 79.939,41 45.631,42 42.265,44 6.495}
{0 CHEMBL382076,1 6.637,2 37.3,3 53.7,4 0.989,5 1.128,6 0.641,7 0.587,8 444.7,9 3,10 12,11 67,13 14,14 33,16 69,17 25,20 11,21 14,22 2,24 36,25 6,26 1,28 2,29 3,31 1,32 31,35 4.5,36 0.116,37 8,38 41,39 66.283,40 75.603,41 42.966,42 39.33,44 8.125}
{0 CHEMBL382926,1 6.899,2 40.7,3 51.9,4 0.989,5 1.118,6 0.661,7 0.606,8 372.57,10 12,11 54,13 14,14 28,16 56,17 22,20 12,21 10,22 2,24 28,25 4,26 1,29 3,31 1,32 26,35 5.6,36 0.089,37 5,38 36,39 53.429,40 60.361,41 35.671,42 32.707,44 6.553}
{0 CHEMBL383184,1 6.367,2 35.6,3 55.4,4 0.989,5 1.133,6 0.625,7 0.572,8 643.02,9 3,10 12,11 101,13 14,14 49,16 105,17 36,20 12,21 24,22 2,24 56,25 9,26 1,28 3,29 5,31 1,32 45,35 5,36 0.143,37 15,38 57,39 99.934,40 114.465,41 63.114,42 57.785,44 8.071}
{0 CHEMBL383368,1 6.222,2 36.5,3 56.5,4 0.983,5 1.131,6 0.63,7 0.57,8 528.88,9 2.4,10 12,11 85,13 14,14 39,16 87,17 31,20 12,21 19,22 2,24 48,25 6,26 1,28 2,29 3,31 1,32 37,35 3.5,36 0.138,37 12,38 47,39 83.585,40 96.094,41 53.535,42 48.491,44 6.032}
{0 CHEMBL406393,1 5.774,2 35.3,3 58.8,4 0.985,5 1.134,6 0.604,7 0.55,8 392.64,11 68,13 1,14 31,16 71,17 24,20 1,21 23,22 1,24 40,25 4,29 4,32 28,35 5.9,36 0.056,37 4,38 32,39 66.981,40 77.142,41 41.046,42 37.395,44 5.201}
{0 CHEMBL409348,1 5.996,2 34.7,3 57.3,4 0.991,5 1.137,6 0.604,7 0.555,8 449.7,9 1.3,11 75,13 2,14 35,16 78,17 26,20 2,21 24,22 2,24 43,25 6,28 1,29 5,32 32,35 6.7,36 0.077,37 6,38 37,39 74.294,40 85.265,41 45.268,42 41.658,44 5.387}
{0 CHEMBL412272,1 6.326,2 32.9,3 57,4 0.995,5 1.137,6 0.609,7 0.558,8 499.79,9 1.3,11 79,13 3,14 37,16 82,17 26,20 1,21 25,22 3,24 45,25 8,26 1,28 1,29 6,31 1,32 34,35 7.6,36 0.085,37 7,38 40,39 78.581,40 89.809,41 48.131,42 44.087,44 4.764}
{0 CHEMBL426152,1 7.171,2 36,3 52,4 1,5 1.126,6 0.647,7 0.596,8 537.81,9 1.3,10 12,11 75,13 16,14 38,16 77,17 27,20 12,21 15,22 4,24 39,25 9,26 2,28 1,29 6,31 2,32 36,35 8,36 0.13,37 10,38 48,39 75.007,40 84.484,41 48.495,42 44.694,44 8.432}
{0 CHEMBL426998,1 6.615,2 39.5,3 53.1,4 0.986,5 1.124,6 0.65,7 0.595,8 535.84,9 2.5,10 18,11 81,13 20,14 41,16 84,17 32,20 17,21 15,22 2,24 43,25 6,26 1,28 2,29 3,31 1,32 38,35 3.7,36 0.119,37 10,38 52,39 79.876,40 91.056,41 52.631,42 48.174,44 8.125}
{0 CHEMBL434814,1 6.171,2 33.9,3 57.1,4 0.989,5 1.137,6 0.613,7 0.559,8 691.12,9 2.7,10 12,11 112,13 14,14 50,16 114,17 38,20 12,21 26,22 2,24 64,25 10,26 1,28 3,29 6,31 1,32 48,35 5.4,36 0.184,37 21,38 58,39 110.795,40 127.335,41 68.614,42 62.607,44 6.699}
{0 CHEMBL436331,1 6.275,2 35.6,3 56.3,4 0.987,5 1.132,6 0.625,7 0.569,8 545.89,9 2.3,10 12,11 87,13 14,14 40,16 89,17 31,20 12,21 19,22 2,24 49,25 7,26 1,28 2,29 4,31 1,32 38,35 4.6,36 0.135,37 12,38 48,39 85.854,40 98.511,41 54.37,42 49.469,44 6.585}
{0 CHEMBL443310,1 6.899,2 40.7,3 51.9,4 0.989,5 1.118,6 0.661,7 0.606,8 372.57,10 12,11 54,13 14,14 28,16 56,17 22,20 12,21 10,22 2,24 28,25 4,26 1,29 3,31 1,32 26,35 5.6,36 0.089,37 5,38 36,39 53.429,40 60.361,41 35.671,42 32.707,44 5.699}
{0 CHEMBL446700,1 6.797,2 40,3 52,4 0.99,5 1.122,6 0.653,7 0.601,8 509.77,9 1.3,10 17,11 75,13 19,14 39,16 78,17 30,20 16,21 14,22 2,24 39,25 6,26 1,28 1,29 4,31 1,32 36,35 5.3,36 0.103,37 8,38 49.5,39 74.276,40 84.145,41 48.938,42 45.077,44 7.77}
{0 CHEMBL538907,1 6.796,2 37.1,3 52.9,4 0.996,5 1.128,6 0.638,7 0.589,8 475.71,9 1.4,10 12,11 70,13 14,14 35,16 72,17 26,20 12,21 14,22 2,24 37,25 7,26 1,28 1,29 5,31 1,32 33,35 7.1,36 0.111,37 8,38 43,39 69.72,40 78.939,41 44.631,42 41.265,44 8.022}
{0 CHEMBL540126,1 6.001,2 35.2,3 58.1,4 0.982,5 1.133,6 0.618,7 0.558,8 630.07,9 1.9,10 12,11 105,13 14,14 46,16 107,17 37,20 12,21 25,22 2,24 61,25 7,26 1,28 2,29 4,31 1,32 44,35 3.8,36 0.168,37 18,38 54,39 103.155,40 119.003,41 64.938,42 58.63,44 8.699}
{0 CHEMBL540128,1 6.136,2 35,3 57.3,4 0.986,5 1.134,6 0.618,7 0.561,8 632.04,9 1.9,10 12,11 103,13 14,14 46,16 105,17 36,20 12,21 24,22 2,24 59,25 8,26 1,28 2,29 5,31 1,32 44,35 4.9,36 0.171,37 18,38 54,39 101.599,40 116.797,41 63.631,42 57.818,44 8.244}
{0 CHEMBL540129,1 6.065,2 35.9,3 57.6,4 0.981,5 1.132,6 0.624,7 0.563,8 557.95,9 2.2,10 12,11 92,13 14,14 41,16 94,17 33,20 12,21 21,22 2,24 53,25 6,26 1,28 2,29 3,31 1,32 39,35 3.3,36 0.138,37 13,38 49,39 90.294,40 104.132,41 57.438,42 51.808,44 5.26}
{0 CHEMBL555022,1 6.001,2 35.2,3 58.1,4 0.982,5 1.133,6 0.618,7 0.558,8 630.07,9 1.9,10 12,11 105,13 14,14 46,16 107,17 37,20 12,21 25,22 2,24 61,25 7,26 1,28 2,29 4,31 1,32 44,35 3.8,36 0.168,37 18,38 54,39 103.155,40 119.003,41 64.938,42 58.63,44 8.699}
{0 CHEMBL555024,1 6.146,2 34.5,3 57.3,4 0.988,5 1.135,6 0.615,7 0.56,8 676.1,9 1.8,10 12,11 110,13 14,14 49,16 112,17 38,20 12,21 26,22 2,24 63,25 9,26 1,28 2,29 6,31 1,32 47,35 5.5,36 0.188,37 21,38 57,39 108.694,40 124.837,41 67.609,42 61.586,44 8.523}
{0 CHEMBL555245,1 6.125,2 35.4,3 57.3,4 0.984,5 1.133,6 0.621,7 0.563,8 587.98,9 2.1,10 12,11 96,13 14,14 43,16 98,17 34,20 12,21 22,22 2,24 55,25 7,26 1,28 2,29 4,31 1,32 41,35 4.2,36 0.153,37 15,38 51,39 94.505,40 108.757,41 59.654,42 54.049,44 8.155}
{0 CHEMBL555246,1 6.124,2 35.2,3 57.1,4 0.985,5 1.134,6 0.621,7 0.563,8 643.07,9 2.9,10 12,11 105,13 15,14 47,16 107,17 37,20 13,21 24,22 3,24 60,25 8,26 1,28 3,29 4,31 1,32 45,35 3.8,36 0.159,37 17,38 56,39 103.374,40 119.086,41 65.183,42 59.124,44 9.119}
{0 CHEMBL611748,1 6.226,2 33.6,3 56.7,4 0.992,5 1.141,6 0.61,7 0.559,8 834.33,9 3.7,10 12,11 134,13 14,14 61,16 137,17 45,20 12,21 33,22 2,23 1,24 76,25 13,26 1,28 5,29 6,31 1,32 58,34 1,35 4.5,36 0.131,37 18,38 69,39 132.872,40 152.955,41 81.751,42 74.931,43 0.7,44 8.523}
{0 CHEMBL94418,1 7.426,2 45,3 45,4 1.004,5 1.116,6 0.67,7 0.641,8 445.55,9 1.7,10 23,11 60,13 23,14 36,16 63,17 27,20 21,21 6,24 27,25 6,28 1,29 5,32 33,35 8.3,36 0.111,37 7,38 47.5,39 60.225,40 66.943,41 40.176,42 38.444,44 5.456}
{0 CHEMBL96145,1 6.827,2 39,3 50.6,4 1.002,5 1.128,6 0.632,7 0.598,8 525.7,9 1.3,10 17,11 77,13 18,14 40,16 79,17 30,20 16,21 14,22 1,24 39,25 8,28 1,29 7,32 38,35 9.1,36 0.177,37 14,38 49.5,39 77.181,40 86.853,41 48.654,42 46.034,44 4.876}
{0 CHEMBL96360,1 7.886,2 45.6,3 42.1,4 1.015,5 1.12,6 0.673,7 0.654,8 449.51,9 1.8,10 23,11 57,13 23,14 36,16 60,17 26,20 21,21 5,23 1,24 24,25 7,28 1,29 5,32 33,34 1,35 8.8,36 0.117,37 7,38 47.5,39 57.854,40 63.867,41 38.352,42 37.3,43 1.8,44 4.31}
{0 CHEMBL96555,1 7.098,2 41.1,3 48.2,4 1.004,5 1.124,6 0.646,7 0.615,8 397.51,9 1.8,10 17,11 56,13 17,14 31,16 58,17 23,20 15,21 8,24 27,25 6,28 1,29 5,32 29,35 8.9,36 0.121,37 7,38 39.5,39 56.225,40 62.943,41 36.176,42 34.444,44 4.967}
{0 CHEMBL96612,1 6.864,2 40.3,3 50,4 1,5 1.125,6 0.64,7 0.605,8 425.57,9 1.6,10 17,11 62,13 17,14 33,16 64,17 25,20 15,21 10,24 31,25 6,28 1,29 5,32 31,35 8.1,36 0.141,37 9,38 41.5,39 61.992,40 69.773,41 39.699,42 37.497,44 5.036}
{0 CHEMBL96642,1 7.098,2 41.1,3 48.2,4 1.004,5 1.124,6 0.646,7 0.615,8 397.51,9 1.8,10 17,11 56,13 17,14 31,16 58,17 23,20 15,21 8,24 27,25 6,28 1,29 5,32 29,35 8.9,36 0.121,37 7,38 39.5,39 56.225,40 62.943,41 36.176,42 34.444,44 5.149}
{0 CHEMBL96648,1 7.224,2 40,3 47.7,4 1.01,5 1.126,6 0.64,7 0.614,8 469.58,9 1.5,10 17,11 65,13 18,14 36,16 67,17 26,20 16,21 10,22 1,24 31,25 8,28 1,29 7,32 34,35 10.8,36 0.149,37 10,38 45.5,39 65.647,40 73.192,41 41.608,42 39.927,44 5.357}
