{
  "data_set_description": {
    "collection_date": "November 2013",
    "creator": "Dr Jeremy Besnard, Dr Ivan Olier, Dr Noureddin Sadawi, Dr Larisa Soldatova, Dr Crina Grosan, Prof Ross King, Dr Richard Bickerton, Prof Andrew Hopkins and Dr Willem van Hoorn",
    "default_target_attribute": "pXC50",
    "description": "This dataset contains QSAR data (from ChEMBL version 17) showing activity values (unit is pseudo-pCI50) of several compounds on drug target ChEMBL_ID: CHEMBL5604 (TID: 101030), and it has 103 rows and 1300 features (not including molecule IDs and class feature: molecule_id and pXC50). The features represent Molecular Descriptors which were generated from SMILES strings. Missing value imputation was applied to this dataset (By choosing the Median).",
    "description_version": "1",
    "file_id": "3273963",
    "format": "ARFF",
    "id": "25444",
    "licence": "Public",
    "md5_checksum": "a0e339269409d7cb76102db39c0897ca",
    "minio_url": "https://data.openml.org/datasets/0002/25444/dataset_25444.pq",
    "name": "QSAR-DATASET-FOR-DRUG-TARGET-CHEMBL5604",
    "original_data_url": "https://www.ebi.ac.uk/chembl/target/inspect/CHEMBL5604",
    "parquet_url": "https://data.openml.org/datasets/0002/25444/dataset_25444.pq",
    "processing_date": "2018-10-03 23:17:23",
    "row_id_attribute": "molecule_id",
    "status": "deactivated",
    "tag": [
      "MetaQSAR",
      "study_13"
    ],
    "upload_date": "2016-07-14T16:57:03",
    "url": "https://api.openml.org/data/v1/download/3273963/QSAR-DATASET-FOR-DRUG-TARGET-CHEMBL5604.arff",
    "version": "8",
    "visibility": "public"
  }
}