{
  "data_features": {
    "feature": [
      {
        "data_type": "nominal",
        "index": "0",
        "is_ignore": "false",
        "is_row_identifier": "true",
        "is_target": "false",
        "name": "molecule_id",
        "nominal_value": [
          "CHEMBL102807",
          "CHEMBL103976",
          "CHEMBL11709",
          "CHEMBL136367",
          "CHEMBL137400",
          "CHEMBL137712",
          "CHEMBL138256",
          "CHEMBL138359",
          "CHEMBL138466",
          "CHEMBL138504",
          "CHEMBL138658",
          "CHEMBL139028",
          "CHEMBL139048",
          "CHEMBL139501",
          "CHEMBL139521",
          "CHEMBL139597",
          "CHEMBL139771",
          "CHEMBL140173",
          "CHEMBL140185",
          "CHEMBL140493",
          "CHEMBL140599",
          "CHEMBL140605",
          "CHEMBL140828",
          "CHEMBL140874",
          "CHEMBL141307",
          "CHEMBL141506",
          "CHEMBL141518",
          "CHEMBL141577",
          "CHEMBL141631",
          "CHEMBL141633",
          "CHEMBL141703",
          "CHEMBL141918",
          "CHEMBL141975",
          "CHEMBL141980",
          "CHEMBL142138",
          "CHEMBL142143",
          "CHEMBL18474",
          "CHEMBL18524",
          "CHEMBL18744",
          "CHEMBL18745",
          "CHEMBL18817",
          "CHEMBL189",
          "CHEMBL18964",
          "CHEMBL18965",
          "CHEMBL19046",
          "CHEMBL1915065",
          "CHEMBL19157",
          "CHEMBL192",
          "CHEMBL2022209",
          "CHEMBL2022212",
          "CHEMBL2022213",
          "CHEMBL2022214",
          "CHEMBL2022215",
          "CHEMBL2022219",
          "CHEMBL2022222",
          "CHEMBL2022223",
          "CHEMBL2024107",
          "CHEMBL2024108",
          "CHEMBL2024109",
          "CHEMBL2024110",
          "CHEMBL2030202",
          "CHEMBL2030203",
          "CHEMBL2030209",
          "CHEMBL2030210",
          "CHEMBL2030216",
          "CHEMBL2110369",
          "CHEMBL2111963",
          "CHEMBL245611",
          "CHEMBL247073",
          "CHEMBL247893",
          "CHEMBL248087",
          "CHEMBL274965",
          "CHEMBL275204",
          "CHEMBL277317",
          "CHEMBL278254",
          "CHEMBL278644",
          "CHEMBL280307",
          "CHEMBL28079",
          "CHEMBL284745",
          "CHEMBL285913",
          "CHEMBL28676",
          "CHEMBL303010",
          "CHEMBL303154",
          "CHEMBL303385",
          "CHEMBL303671",
          "CHEMBL303917",
          "CHEMBL303920",
          "CHEMBL304161",
          "CHEMBL304389",
          "CHEMBL305237",
          "CHEMBL305617",
          "CHEMBL305618",
          "CHEMBL305988",
          "CHEMBL305989",
          "CHEMBL306417",
          "CHEMBL306426",
          "CHEMBL306666",
          "CHEMBL307232",
          "CHEMBL307379",
          "CHEMBL307639",
          "CHEMBL307640",
          "CHEMBL308199",
          "CHEMBL308249",
          "CHEMBL308747",
          "CHEMBL308828",
          "CHEMBL308973",
          "CHEMBL319217",
          "CHEMBL32255",
          "CHEMBL334684",
          "CHEMBL334910",
          "CHEMBL335148",
          "CHEMBL336050",
          "CHEMBL336457",
          "CHEMBL336716",
          "CHEMBL337587",
          "CHEMBL337770",
          "CHEMBL341939",
          "CHEMBL342008",
          "CHEMBL342459",
          "CHEMBL342876",
          "CHEMBL343325",
          "CHEMBL343553",
          "CHEMBL343781",
          "CHEMBL343832",
          "CHEMBL343941",
          "CHEMBL343971",
          "CHEMBL343973",
          "CHEMBL344173",
          "CHEMBL344630",
          "CHEMBL344676",
          "CHEMBL344700",
          "CHEMBL344852",
          "CHEMBL344855",
          "CHEMBL394963",
          "CHEMBL394999",
          "CHEMBL396831",
          "CHEMBL397115",
          "CHEMBL397116",
          "CHEMBL397383",
          "CHEMBL398079",
          "CHEMBL409425",
          "CHEMBL416541",
          "CHEMBL418367",
          "CHEMBL419447",
          "CHEMBL422104",
          "CHEMBL422235",
          "CHEMBL423550",
          "CHEMBL429476",
          "CHEMBL430802",
          "CHEMBL431377",
          "CHEMBL431772",
          "CHEMBL434797",
          "CHEMBL436019",
          "CHEMBL445576",
          "CHEMBL446663",
          "CHEMBL470310",
          "CHEMBL470311",
          "CHEMBL470492",
          "CHEMBL471528",
          "CHEMBL471529",
          "CHEMBL471701",
          "CHEMBL471702",
          "CHEMBL471703",
          "CHEMBL472558",
          "CHEMBL472559",
          "CHEMBL473301",
          "CHEMBL473507",
          "CHEMBL487247",
          "CHEMBL488080",
          "CHEMBL488091",
          "CHEMBL488265",
          "CHEMBL502020",
          "CHEMBL504118",
          "CHEMBL512174",
          "CHEMBL513593",
          "CHEMBL520074",
          "CHEMBL521075",
          "CHEMBL524871",
          "CHEMBL592986",
          "CHEMBL593225",
          "CHEMBL594160",
          "CHEMBL595104",
          "CHEMBL595330",
          "CHEMBL596454",
          "CHEMBL596489",
          "CHEMBL603422",
          "CHEMBL604271",
          "CHEMBL63",
          "CHEMBL68152",
          "CHEMBL68706",
          "CHEMBL69324",
          "CHEMBL70295",
          "CHEMBL70471",
          "CHEMBL70569",
          "CHEMBL70837",
          "CHEMBL70951",
          "CHEMBL71204",
          "CHEMBL71300",
          "CHEMBL71768",
          "CHEMBL71824",
          "CHEMBL71874",
          "CHEMBL72812",
          "CHEMBL779"
        ],
        "number_of_missing_values": "0"
      },
      {
        "data_type": "numeric",
        "index": "1",
        "is_ignore": "false",
        "is_row_identifier": "false",
        "is_target": "false",
        "name": "FCFP4_1024b983",
        "number_of_missing_values": "0"
      },
      {
        "data_type": "numeric",
        "index": "2",
        "is_ignore": "false",
        "is_row_identifier": "false",
        "is_target": "false",
        "name": "FCFP4_1024b78",
        "number_of_missing_values": "0"
      },
      {
        "data_type": "numeric",
        "index": "3",
        "is_ignore": "false",
        "is_row_identifier": "false",
        "is_target": "false",
        "name": "FCFP4_1024b65",
        "number_of_missing_values": "0"
      },
      {
        "data_type": "numeric",
        "index": "4",
        "is_ignore": "false",
        "is_row_identifier": "false",
        "is_target": "false",
        "name": "FCFP4_1024b300",
        "number_of_missing_values": "0"
      },
      {
        "data_type": "numeric",
        "index": "5",
        "is_ignore": "false",
        "is_row_identifier": "false",
        "is_target": "false",
        "name": "FCFP4_1024b376",
        "number_of_missing_values": "0"
      },
      {
        "data_type": "numeric",
        "index": "6",
        "is_ignore": "false",
        "is_row_identifier": "false",
        "is_target": "false",
        "name": "FCFP4_1024b1005",
        "number_of_missing_values": "0"
      },
      {
        "data_type": "numeric",
        "index": "7",
        "is_ignore": "false",
        "is_row_identifier": "false",
        "is_target": "false",
        "name": "FCFP4_1024b781",
        "number_of_missing_values": "0"
      },
      {
        "data_type": "numeric",
        "index": "8",
        "is_ignore": "false",
        "is_row_identifier": "false",
        "is_target": "false",
        "name": "FCFP4_1024b429",
        "number_of_missing_values": "0"
      },
      {
        "data_type": "numeric",
        "index": "9",
        "is_ignore": "false",
        "is_row_identifier": "false",
        "is_target": "false",
        "name": "FCFP4_1024b153",
        "number_of_missing_values": "0"
      },
      {
        "data_type": "numeric",
        "index": "10",
        "is_ignore": "false",
        "is_row_identifier": "false",
        "is_target": "false",
        "name": "FCFP4_1024b490",
        "number_of_missing_values": "0"
      },
      {
        "data_type": "numeric",
        "index": "11",
        "is_ignore": "false",
        "is_row_identifier": "false",
        "is_target": "false",
        "name": "FCFP4_1024b1",
        "number_of_missing_values": "0"
      },
      {
        "data_type": "numeric",
        "index": "12",
        "is_ignore": "false",
        "is_row_identifier": "false",
        "is_target": "false",
        "name": "FCFP4_1024b10",
        "number_of_missing_values": "0"
      },
      {
        "data_type": "numeric",
        "index": "13",
        "is_ignore": "false",
        "is_row_identifier": "false",
        "is_target": "false",
        "name": "FCFP4_1024b100",
        "number_of_missing_values": "0"
      },
      {
        "data_type": "numeric",
        "index": "14",
        "is_ignore": "false",
        "is_row_identifier": "false",
        "is_target": "false",
        "name": "FCFP4_1024b1000",
        "number_of_missing_values": "0"
      },
      {
        "data_type": "numeric",
        "index": "15",
        "is_ignore": "false",
        "is_row_identifier": "false",
        "is_target": "false",
        "name": "FCFP4_1024b1001",
        "number_of_missing_values": "0"
      },
      {
        "data_type": "numeric",
        "index": "16",
        "is_ignore": "false",
        "is_row_identifier": "false",
        "is_target": "false",
        "name": "FCFP4_1024b1002",
        "number_of_missing_values": "0"
      },
      {
        "data_type": "numeric",
        "index": "17",
        "is_ignore": "false",
        "is_row_identifier": "false",
        "is_target": "false",
        "name": "FCFP4_1024b1003",
        "number_of_missing_values": "0"
      },
      {
        "data_type": "numeric",
        "index": "18",
        "is_ignore": "false",
        "is_row_identifier": "false",
        "is_target": "false",
        "name": "FCFP4_1024b1004",
        "number_of_missing_values": "0"
      },
      {
        "data_type": "numeric",
        "index": "19",
        "is_ignore": "false",
        "is_row_identifier": "false",
        "is_target": "false",
        "name": "FCFP4_1024b1006",
        "number_of_missing_values": "0"
      },
      {
        "data_type": "numeric",
        "index": "20",
        "is_ignore": "false",
        "is_row_identifier": "false",
        "is_target": "false",
        "name": "FCFP4_1024b1007",
        "number_of_missing_values": "0"
      },
      {
        "data_type": "numeric",
        "index": "21",
        "is_ignore": "false",
        "is_row_identifier": "false",
        "is_target": "false",
        "name": "FCFP4_1024b1008",
        "number_of_missing_values": "0"
      },
      {
        "data_type": "numeric",
        "index": "22",
        "is_ignore": "false",
        "is_row_identifier": "false",
        "is_target": "false",
        "name": "FCFP4_1024b1009",
        "number_of_missing_values": "0"
      },
      {
        "data_type": "numeric",
        "index": "23",
        "is_ignore": "false",
        "is_row_identifier": "false",
        "is_target": "false",
        "name": "FCFP4_1024b101",
        "number_of_missing_values": "0"
      },
      {
        "data_type": "numeric",
        "index": "24",
        "is_ignore": "false",
        "is_row_identifier": "false",
        "is_target": "false",
        "name": "FCFP4_1024b1010",
        "number_of_missing_values": "0"
      },
      {
        "data_type": "numeric",
        "index": "25",
        "is_ignore": "false",
        "is_row_identifier": "false",
        "is_target": "false",
        "name": "FCFP4_1024b1011",
        "number_of_missing_values": "0"
      },
      {
        "data_type": "numeric",
        "index": "26",
        "is_ignore": "false",
        "is_row_identifier": "false",
        "is_target": "false",
        "name": "FCFP4_1024b1012",
        "number_of_missing_values": "0"
      },
      {
        "data_type": "numeric",
        "index": "27",
        "is_ignore": "false",
        "is_row_identifier": "false",
        "is_target": "false",
        "name": "FCFP4_1024b1013",
        "number_of_missing_values": "0"
      },
      {
        "data_type": "numeric",
        "index": "28",
        "is_ignore": "false",
        "is_row_identifier": "false",
        "is_target": "false",
        "name": "FCFP4_1024b1014",
        "number_of_missing_values": "0"
      },
      {
        "data_type": "numeric",
        "index": "29",
        "is_ignore": "false",
        "is_row_identifier": "false",
        "is_target": "false",
        "name": "FCFP4_1024b1015",
        "number_of_missing_values": "0"
      },
      {
        "data_type": "numeric",
        "index": "30",
        "is_ignore": "false",
        "is_row_identifier": "false",
        "is_target": "false",
        "name": "FCFP4_1024b1016",
        "number_of_missing_values": "0"
      },
      {
        "data_type": "numeric",
        "index": "31",
        "is_ignore": "false",
        "is_row_identifier": "false",
        "is_target": "false",
        "name": "FCFP4_1024b1017",
        "number_of_missing_values": "0"
      },
      {
        "data_type": "numeric",
        "index": "32",
        "is_ignore": "false",
        "is_row_identifier": "false",
        "is_target": "false",
        "name": "FCFP4_1024b1018",
        "number_of_missing_values": "0"
      },
      {
        "data_type": "numeric",
        "index": "33",
        "is_ignore": "false",
        "is_row_identifier": "false",
        "is_target": "false",
        "name": "FCFP4_1024b1019",
        "number_of_missing_values": "0"
      },
      {
        "data_type": "numeric",
        "index": "34",
        "is_ignore": "false",
        "is_row_identifier": "false",
        "is_target": "false",
        "name": "FCFP4_1024b102",
        "number_of_missing_values": "0"
      },
      {
        "data_type": "numeric",
        "index": "35",
        "is_ignore": "false",
        "is_row_identifier": "false",
        "is_target": "false",
        "name": "FCFP4_1024b1020",
        "number_of_missing_values": "0"
      },
      {
        "data_type": "numeric",
        "index": "36",
        "is_ignore": "false",
        "is_row_identifier": "false",
        "is_target": "false",
        "name": "FCFP4_1024b1021",
        "number_of_missing_values": "0"
      },
      {
        "data_type": "numeric",
        "index": "37",
        "is_ignore": "false",
        "is_row_identifier": "false",
        "is_target": "false",
        "name": "FCFP4_1024b1022",
        "number_of_missing_values": "0"
      },
      {
        "data_type": "numeric",
        "index": "38",
        "is_ignore": "false",
        "is_row_identifier": "false",
        "is_target": "false",
        "name": "FCFP4_1024b1023",
        "number_of_missing_values": "0"
      },
      {
        "data_type": "numeric",
        "index": "39",
        "is_ignore": "false",
        "is_row_identifier": "false",
        "is_target": "false",
        "name": "FCFP4_1024b1024",
        "number_of_missing_values": "0"
      },
      {
        "data_type": "numeric",
        "index": "40",
        "is_ignore": "false",
        "is_row_identifier": "false",
        "is_target": "false",
        "name": "FCFP4_1024b103",
        "number_of_missing_values": "0"
      },
      {
        "data_type": "numeric",
        "index": "41",
        "is_ignore": "false",
        "is_row_identifier": "false",
        "is_target": "false",
        "name": "FCFP4_1024b104",
        "number_of_missing_values": "0"
      },
      {
        "data_type": "numeric",
        "index": "42",
        "is_ignore": "false",
        "is_row_identifier": "false",
        "is_target": "false",
        "name": "FCFP4_1024b105",
        "number_of_missing_values": "0"
      },
      {
        "data_type": "numeric",
        "index": "43",
        "is_ignore": "false",
        "is_row_identifier": "false",
        "is_target": "false",
        "name": "FCFP4_1024b106",
        "number_of_missing_values": "0"
      },
      {
        "data_type": "numeric",
        "index": "44",
        "is_ignore": "false",
        "is_row_identifier": "false",
        "is_target": "false",
        "name": "FCFP4_1024b107",
        "number_of_missing_values": "0"
      },
      {
        "data_type": "numeric",
        "index": "45",
        "is_ignore": "false",
        "is_row_identifier": "false",
        "is_target": "false",
        "name": "FCFP4_1024b108",
        "number_of_missing_values": "0"
      },
      {
        "data_type": "numeric",
        "index": "46",
        "is_ignore": "false",
        "is_row_identifier": "false",
        "is_target": "false",
        "name": "FCFP4_1024b109",
        "number_of_missing_values": "0"
      },
      {
        "data_type": "numeric",
        "index": "47",
        "is_ignore": "false",
        "is_row_identifier": "false",
        "is_target": "false",
        "name": "FCFP4_1024b11",
        "number_of_missing_values": "0"
      },
      {
        "data_type": "numeric",
        "index": "48",
        "is_ignore": "false",
        "is_row_identifier": "false",
        "is_target": "false",
        "name": "FCFP4_1024b110",
        "number_of_missing_values": "0"
      },
      {
        "data_type": "numeric",
        "index": "49",
        "is_ignore": "false",
        "is_row_identifier": "false",
        "is_target": "false",
        "name": "FCFP4_1024b111",
        "number_of_missing_values": "0"
      },
      {
        "data_type": "numeric",
        "index": "50",
        "is_ignore": "false",
        "is_row_identifier": "false",
        "is_target": "false",
        "name": "FCFP4_1024b112",
        "number_of_missing_values": "0"
      },
      {
        "data_type": "numeric",
        "index": "51",
        "is_ignore": "false",
        "is_row_identifier": "false",
        "is_target": "false",
        "name": "FCFP4_1024b113",
        "number_of_missing_values": "0"
      },
      {
        "data_type": "numeric",
        "index": "52",
        "is_ignore": "false",
        "is_row_identifier": "false",
        "is_target": "true",
        "name": "pXC50",
        "number_of_missing_values": "0"
      }
    ]
  }
}