"molecule_id","RBN","nCsp2","nAB","Se","Si","RBF","nBT","nSK","nAT","Sv","MW","nBO","nBM","pXC50"
{1 4,2 21,3 23,4 41.596,5 46.262,6 0.089,7 45,8 25,9 42,10 29.085,11 344.86,12 28,13 23,14 5.456}
{0 CHEMBL107,1 5,2 14,3 6,4 54.669,5 60.737,6 0.089,7 56,8 29,9 54,10 33.632,11 399.48,12 31,13 11,14 4.301}
{0 CHEMBL114,1 13,2 19,3 17,4 98.687,5 112.171,6 0.126,7 103,8 49,9 99,10 59.292,11 670.94,12 53,13 21,14 4.301}
{0 CHEMBL1200633,1 8,2 9,4 136.275,5 154.294,6 0.056,7 142,8 62,9 136,10 77.499,11 875.22,12 68,13 5,14 6.301}
{0 CHEMBL1385840,1 4,2 13,3 10,4 80.167,5 90.597,6 0.047,7 86,8 41,9 80,10 48.637,11 561.75,12 47,13 14,14 4.719}
{0 CHEMBL1403281,1 5,2 13,3 10,4 83.05,5 94.012,6 0.056,7 89,8 42,9 83,10 50.163,11 575.78,12 48,13 14,14 4.57}
{0 CHEMBL1423,1 7,2 19,3 18,4 63.029,5 71.197,6 0.104,7 67,8 34,9 63,10 39.921,11 461.6,12 38,13 19,14 4.301}
{0 CHEMBL1484,1 10,2 18,3 12,4 64.756,5 72.149,6 0.152,7 66,8 35,9 64,10 40.201,11 479.58,12 37,13 18,14 5.097}
{0 CHEMBL152046,1 7,2 14,3 12,4 52.236,5 59.687,6 0.127,7 55,8 26,9 53,10 32.101,11 349.52,12 28,13 14,14 4.398}
{0 CHEMBL152157,1 7,2 20,3 18,4 68.083,5 76.378,6 0.097,7 72,8 37,9 68,10 43.433,11 519.09,12 41,13 20,14 5.975}
{0 CHEMBL152447,1 7,2 20,3 18,4 69.861,5 78.933,6 0.095,7 74,8 37,9 70,10 43.627,11 499.67,12 41,13 20,14 5.699}
{0 CHEMBL152590,1 8,2 20,3 18,4 68.541,5 77.351,6 0.11,7 73,8 36,9 69,10 43.111,11 483.66,12 40,13 20,14 6.097}
{0 CHEMBL152651,1 8,2 20,3 18,4 71.97,5 81.059,6 0.105,7 76,8 38,9 72,10 44.847,11 514.68,12 42,13 20,14 7.301}
{0 CHEMBL153452,1 4,2 20,3 18,4 47.585,5 53.441,6 0.078,7 51,8 27,9 48,10 31.52,11 355.47,12 30,13 20,14 4.387}
{0 CHEMBL154003,1 7,2 26,3 24,4 69.658,5 77.936,6 0.093,7 75,8 39,9 70,10 45.584,11 517.67,12 44,13 26,14 5.987}
{0 CHEMBL154004,1 5,2 19,3 18,4 49.687,5 55.939,6 0.094,7 53,8 28,9 50,10 32.542,11 370.49,12 31,13 20,14 5}
{0 CHEMBL154430,1 7,2 20,3 18,4 69.861,5 78.933,6 0.095,7 74,8 37,9 70,10 43.627,11 499.67,12 41,13 20,14 5.143}
{0 CHEMBL154490,1 6,2 18,3 18,4 62.76,5 71.265,6 0.09,7 67,8 34,9 63,10 39.659,11 455.62,12 38,13 20,14 6.409}
{0 CHEMBL154596,1 7,2 20,3 18,4 70.643,5 79.849,6 0.093,7 75,8 37,9 71,10 44.132,11 498.68,12 41,13 20,14 6.201}
{0 CHEMBL156894,1 7,2 20,3 18,4 68.083,5 76.378,6 0.097,7 72,8 37,9 68,10 43.433,11 519.09,12 41,13 20,14 6.796}
{0 CHEMBL156947,1 7,2 20,3 18,4 68.541,5 77.351,6 0.096,7 73,8 36,9 69,10 43.111,11 483.66,12 40,13 20,14 6}
{0 CHEMBL157162,1 10,2 20,3 18,4 69.643,5 78.849,6 0.137,7 73,8 36,9 70,10 43.132,11 486.67,12 39,13 20,14 5.721}
{0 CHEMBL157318,1 6,2 20,3 18,4 63.545,5 70.524,6 0.088,7 68,8 36,9 63,10 40.96,11 485.58,12 41,13 20,14 5.432}
{0 CHEMBL159,1 10,2 19,3 16,4 117.21,5 132.088,6 0.08,7 125,8 59,9 117,10 70.742,11 811.08,12 67,13 20,14 5.097}
{0 CHEMBL160,1 15,2 13,4 195.227,5 224.754,6 0.077,7 196,8 85,9 196,10 108.153,11 1202.84,12 85,13 12,14 6.155}
{0 CHEMBL163,1 18,2 21,3 22,4 97.956,5 110.596,6 0.178,7 101,8 50,9 98,10 60.139,11 721.05,12 53,13 25,14 4.301}
{0 CHEMBL17157,1 9,2 18,3 18,4 74.428,5 85.221,6 0.114,7 79,8 35,9 76,10 44.987,11 471.74,12 38,13 18,14 5.699}
{0 CHEMBL1751,1 7,2 3,4 119.857,5 135.218,6 0.056,7 126,8 55,9 119,10 67.865,11 781.05,12 62,13 2,14 4.301}
{0 CHEMBL1790041,1 10,2 6,3 5,4 43.418,5 49.278,6 0.233,7 43,8 21,9 43,10 25.158,11 314.46,12 21,13 8,14 4.301}
{0 CHEMBL197,1 13,2 12,3 12,4 70.418,5 80.308,6 0.181,7 72,8 33,9 71,10 41.384,11 454.67,12 34,13 13,14 5.699}
{0 CHEMBL21578,1 4,2 11,3 11,4 47.578,5 53.983,6 0.078,7 51,8 24,9 48,10 29.267,11 324.46,12 27,13 12,14 5}
{0 CHEMBL22587,1 11,2 22,3 23,4 87.909,5 98.355,6 0.118,7 93,8 49,9 87,10 56.114,11 705.71,12 55,13 25,14 6.155}
{0 CHEMBL258896,1 9,2 26,3 24,4 75.752,5 84.976,6 0.113,7 80,8 41,9 76,10 48.352,11 549.72,12 45,13 26,14 6.588}
{0 CHEMBL26017,1 5,2 12,3 16,4 58.658,5 66.766,6 0.079,7 63,8 31,9 59,10 36.638,11 416.58,12 35,13 17,14 4.79}
{0 CHEMBL264490,1 8,2 20,3 18,4 70.632,5 78.936,6 0.108,7 74,8 39,9 70,10 44.529,11 529.65,12 43,13 22,14 5.959}
{0 CHEMBL26485,1 7,2 18,3 22,4 70.552,5 79.775,6 0.093,7 75,8 39,9 70,10 44.48,11 531.67,12 44,13 23,14 5.469}
{0 CHEMBL26599,1 5,2 13,3 16,4 58.683,5 66.446,6 0.081,7 62,8 32,9 58,10 36.405,11 440.55,12 36,13 17,14 4.301}
{0 CHEMBL26635,1 5,2 17,3 22,4 64.458,5 72.735,6 0.072,7 69,8 37,9 64,10 41.711,11 499.62,12 42,13 23,14 5.883}
{0 CHEMBL26707,1 5,2 12,3 16,4 57.33,5 65.557,6 0.081,7 62,8 30,9 58,10 35.923,11 400.58,12 34,13 17,14 4.886}
{0 CHEMBL26795,1 4,2 12,3 16,4 55.472,5 62.821,6 0.068,7 59,8 31,9 55,10 35.163,11 422.53,12 35,13 17,14 4.978}
{0 CHEMBL26892,1 5,2 15,3 21,4 65.174,5 74.307,6 0.07,7 71,8 34,9 66,10 41.164,11 472.72,12 39,13 21,14 5.222}
{0 CHEMBL26934,1 5,2 12,3 16,4 57.32,5 64.644,6 0.082,7 61,8 32,9 57,10 36.321,11 431.55,12 36,13 19,14 4.301}
{0 CHEMBL27102,1 9,2 19,3 22,4 79.756,5 89.941,6 0.107,7 84,8 43,9 79,10 49.468,11 590.74,12 48,13 23,14 5.432}
{0 CHEMBL27171,1 5,2 12,3 16,4 57.32,5 64.644,6 0.082,7 61,8 32,9 57,10 36.321,11 431.55,12 36,13 19,14 4.888}
{0 CHEMBL27172,1 5,2 12,3 16,4 57.32,5 64.644,6 0.082,7 61,8 32,9 57,10 36.321,11 431.55,12 36,13 19,14 5.015}
{0 CHEMBL27452,1 6,2 13,3 16,4 61.323,5 70.099,6 0.091,7 66,8 31,9 62,10 37.67,11 417.61,12 35,13 17,14 4.301}
{0 CHEMBL27497,1 5,2 18,3 22,4 64.214,5 72.972,6 0.071,7 70,8 35,9 65,10 41.45,11 462.65,12 40,13 23,14 5.301}
{0 CHEMBL27517,1 4,2 12,3 16,4 54.771,5 62.086,6 0.068,7 59,8 30,9 55,10 35.224,11 420.99,12 34,13 17,14 4.975}
{0 CHEMBL27524,1 4,2 12,3 16,4 43.542,5 48.322,6 0.087,7 46,8 26,9 43,10 28.885,11 367.47,12 29,13 19,14 5.268}
{0 CHEMBL27634,1 4,2 12,3 16,4 45.578,5 51.813,6 0.082,7 49,8 25,9 46,10 29.321,11 331.46,12 28,13 17,14 4.481}
{0 CHEMBL27709,1 5,2 18,3 22,4 68.123,5 77.067,6 0.068,7 73,8 38,9 68,10 43.743,11 512.66,12 43,13 23,14 4.745}
{0 CHEMBL27823,1 4,2 12,3 16,4 54.516,5 61.862,6 0.068,7 59,8 30,9 55,10 35.713,11 512.44,12 34,13 17,14 4.884}
{0 CHEMBL27834,1 4,2 13,3 16,4 53.891,5 60.936,6 0.069,7 58,8 30,9 54,10 34.584,11 400.53,12 34,13 18,14 4.638}
{0 CHEMBL27841,1 4,2 12,3 16,4 51.563,5 58.727,6 0.071,7 56,8 28,9 52,10 32.87,11 372.52,12 32,13 17,14 4.301}
{0 CHEMBL27861,1 4,2 14,3 20,4 58.549,5 66.64,6 0.063,7 64,8 32,9 59,10 37.418,11 425.59,12 37,13 21,14 5.235}
{0 CHEMBL28061,1 4,2 12,3 16,4 54.771,5 62.086,6 0.068,7 59,8 30,9 55,10 35.224,11 420.99,12 34,13 17,14 4.747}
{0 CHEMBL28098,1 4,2 12,3 16,4 54.447,5 62.142,6 0.068,7 59,8 29,9 55,10 34.396,11 386.55,12 33,13 17,14 5.016}
{0 CHEMBL280981,1 6,2 18,3 22,4 67.669,5 76.359,6 0.083,7 72,8 38,9 67,10 42.953,11 517.64,12 43,13 23,14 5.305}
{0 CHEMBL281252,1 6,2 13,3 16,4 59.767,5 67.893,6 0.094,7 64,8 31,9 60,10 36.858,11 419.58,12 35,13 17,14 4.783}
{0 CHEMBL282151,1 6,2 19,3 22,4 65.323,5 74.099,6 0.085,7 71,8 35,9 66,10 41.67,11 465.65,12 40,13 23,14 4.971}
{0 CHEMBL282592,1 5,2 16,3 22,4 61.432,5 70.055,6 0.075,7 67,8 33,9 62,10 38.945,11 439.62,12 38,13 22,14 4.301}
{0 CHEMBL282610,1 4,2 12,3 16,4 54.771,5 62.086,6 0.068,7 59,8 30,9 55,10 35.224,11 420.99,12 34,13 17,14 5.036}
{0 CHEMBL282611,1 4,2 12,3 16,4 42.694,5 48.398,6 0.087,7 46,8 24,9 43,10 27.795,11 317.43,12 27,13 17,14 4.796}
{0 CHEMBL283835,1 6,2 19,3 22,4 71.527,5 81.095,6 0.078,7 77,8 39,9 72,10 45.713,11 519.71,12 44,13 24,14 4.625}
{0 CHEMBL285576,1 5,2 14,3 21,4 61.76,5 70.265,6 0.075,7 67,8 33,9 62,10 38.659,11 443.61,12 38,13 21,14 5.432}
{0 CHEMBL285830,1 4,2 12,3 16,4 55.294,5 62.065,6 0.068,7 59,8 31,9 55,10 35.486,11 436.59,12 35,13 19,14 4.854}
{0 CHEMBL286272,1 6,2 13,3 16,4 64.45,5 73.276,6 0.088,7 68,8 34,9 64,10 39.458,11 468.61,12 38,13 17,14 5.32}
{0 CHEMBL294616,1 7,2 17,3 12,4 83.974,5 93.856,6 0.082,7 85,8 44,9 83,10 51.44,11 645.88,12 46,13 17,14 4.301}
{0 CHEMBL295698,1 7,2 16,3 17,4 64.851,5 72.116,6 0.103,7 68,8 36,9 64,10 41.448,11 531.48,12 40,13 18,14 5.174}
{0 CHEMBL296419,1 8,2 19,3 22,4 64.618,5 73.355,6 0.116,7 69,8 34,9 65,10 40.559,11 458.63,12 38,13 22,14 5.77}
{0 CHEMBL30,1 7,2 4,3 5,4 33.105,5 37.986,6 0.212,7 33,8 17,9 33,10 19.95,11 252.39,12 17,13 7,14 4.301}
{0 CHEMBL345316,1 9,2 20,3 18,4 73.527,5 83.265,6 0.115,7 78,8 38,9 74,10 45.659,11 512.71,12 42,13 20,14 5.886}
{0 CHEMBL346292,1 9,2 26,3 24,4 72.869,5 81.561,6 0.117,7 77,8 40,9 73,10 46.825,11 535.69,12 44,13 26,14 6.522}
{0 CHEMBL346486,1 7,2 20,3 18,4 68.083,5 76.378,6 0.097,7 72,8 37,9 68,10 43.433,11 519.09,12 41,13 20,14 5.77}
{0 CHEMBL347672,1 5,2 20,3 18,4 59.338,5 67.185,6 0.078,7 64,8 32,9 60,10 38.122,11 424.59,12 36,13 20,14 5.301}
{0 CHEMBL348475,1 11,2 29,3 29,4 86.392,5 96.308,6 0.121,7 91,8 48,9 86,10 55.33,11 646.8,12 53,13 31,14 7.192}
{0 CHEMBL348567,1 4,2 14,3 12,4 53.236,5 60.687,6 0.07,7 57,8 27,9 54,10 33.101,11 361.53,12 30,13 14,14 4.854}
{0 CHEMBL350775,1 16,2 19,3 18,4 85.385,5 95.85,6 0.182,7 88,8 44,9 85,10 52.077,11 603.78,12 47,13 21,14 5.301}
{0 CHEMBL356477,1 9,2 21,3 18,4 79.283,5 89.182,6 0.108,7 83,8 42,9 79,10 49.11,11 571.74,12 46,13 21,14 5.377}
{0 CHEMBL356478,1 8,2 20,3 18,4 70.632,5 78.936,6 0.108,7 74,8 39,9 70,10 44.529,11 529.65,12 43,13 22,14 6.222}
{0 CHEMBL357064,1 6,2 20,3 18,4 59.891,5 67.106,6 0.094,7 64,8 33,9 60,10 38.53,11 441.57,12 37,13 20,14 5.097}
{0 CHEMBL357996,1 7,2 20,3 18,4 67.207,5 76.514,6 0.097,7 72,8 35,9 68,10 42.197,11 467.67,12 39,13 20,14 5.678}
{0 CHEMBL384467,1 2,2 6,4 57.403,5 64.615,6 0.033,7 60,8 28,9 57,10 33.859,11 392.51,12 31,13 4,14 4.301}
{0 CHEMBL389621,1 2,2 4,4 55.891,5 63.275,6 0.034,7 59,8 26,9 56,10 32.476,11 362.51,12 29,13 3,14 4.301}
{0 CHEMBL421980,1 7,2 20,3 18,4 67.76,5 76.434,6 0.097,7 72,8 36,9 68,10 42.605,11 484.65,12 40,13 20,14 5.971}
{0 CHEMBL423413,1 7,2 20,3 18,4 68.083,5 76.378,6 0.097,7 72,8 37,9 68,10 43.433,11 519.09,12 41,13 20,14 5.87}
{0 CHEMBL428402,1 7,2 29,3 29,4 69.549,5 77.81,6 0.093,7 75,8 40,9 70,10 46.364,11 526.68,12 45,13 31,14 6.498}
{0 CHEMBL433715,1 7,2 20,3 18,4 67.76,5 76.434,6 0.097,7 72,8 36,9 68,10 42.605,11 484.65,12 40,13 20,14 5.796}
{0 CHEMBL435437,1 6,2 24,3 23,4 65.774,5 73.521,6 0.085,7 71,8 37,9 66,10 43.057,11 491.63,12 42,13 25,14 6.071}
{0 CHEMBL442,1 4,2 19,3 16,4 78.4,5 87.767,6 0.047,7 85,8 43,9 78,10 49.583,11 581.73,12 50,13 20,14 4.745}
{0 CHEMBL444075,1 9,2 29,3 29,4 77.97,5 87.059,6 0.108,7 83,8 44,9 78,10 50.847,11 586.74,12 49,13 31,14 7.301}
{0 CHEMBL446315,1 5,2 19,3 16,4 84.167,5 94.597,6 0.055,7 91,8 45,9 84,10 52.637,11 609.79,12 52,13 20,14 4.815}
{0 CHEMBL44657,1 5,2 13,3 12,4 76.393,5 83.365,6 0.063,7 80,8 42,9 74,10 46.721,11 588.61,12 48,13 13,14 4.301}
{0 CHEMBL45816,1 12,2 14,3 16,4 73.705,5 83.936,6 0.156,7 77,8 36,9 74,10 44.074,11 495.7,12 39,13 17,14 5}
{0 CHEMBL493,1 5,2 13,3 10,4 83.279,5 93.854,6 0.056,7 89,8 43,9 83,10 51.189,11 654.67,12 49,13 14,14 5.194}
{0 CHEMBL532,1 7,2 2,4 118.516,5 134.922,6 0.058,7 120,8 51,9 118,10 64.698,11 734.05,12 53,13 2,14 4.456}
{0 CHEMBL633,1 11,2 15,3 16,4 59.476,5 66.796,6 0.177,7 62,8 31,9 60,10 38.701,11 645.35,12 33,13 17,14 4.896}
{0 CHEMBL655,1 1,2 16,3 17,4 36.443,5 40.27,6 0.026,7 39,8 23,9 36,10 25.436,11 325.79,12 26,13 18,14 4.481}
{0 CHEMBL70,2 8,3 6,4 40.036,5 44.863,7 44,8 21,9 40,10 24.907,11 285.37,12 25,13 7,14 4.301}
{0 CHEMBL772,1 10,2 16,3 16,4 84.938,5 94.77,6 0.112,7 89,8 44,9 84,10 51.485,11 608.75,12 49,13 18,14 4.747}
{0 CHEMBL91,1 6,2 15,3 17,4 39.895,5 43.304,6 0.146,7 41,8 25,9 39,10 28.282,11 416.14,12 27,13 17,14 5.699}
