"molecule_id","FCFP4_1024b1","FCFP4_1024b10","FCFP4_1024b100","FCFP4_1024b1000","FCFP4_1024b1001","FCFP4_1024b1002","FCFP4_1024b1003","FCFP4_1024b1004","FCFP4_1024b1005","FCFP4_1024b1006","FCFP4_1024b1007","FCFP4_1024b1008","FCFP4_1024b1009","FCFP4_1024b101","FCFP4_1024b1010","FCFP4_1024b1011","FCFP4_1024b1012","FCFP4_1024b1013","FCFP4_1024b1014","FCFP4_1024b1015","FCFP4_1024b1016","FCFP4_1024b1017","FCFP4_1024b1018","FCFP4_1024b1019","FCFP4_1024b102","FCFP4_1024b1020","FCFP4_1024b1021","FCFP4_1024b1022","FCFP4_1024b1023","FCFP4_1024b1024","FCFP4_1024b103","FCFP4_1024b104","FCFP4_1024b105","FCFP4_1024b106","FCFP4_1024b107","FCFP4_1024b108","FCFP4_1024b109","FCFP4_1024b11","FCFP4_1024b110","FCFP4_1024b111","FCFP4_1024b112","FCFP4_1024b113","FCFP4_1024b114","FCFP4_1024b115","FCFP4_1024b116","FCFP4_1024b117","FCFP4_1024b118","FCFP4_1024b119","FCFP4_1024b12","FCFP4_1024b120","FCFP4_1024b121","pXC50"
{1 1,52 4.004}
{0 CHEMBL1300370,1 1,35 1,52 4.07}
{0 CHEMBL1300464,1 1,52 4.004}
{0 CHEMBL1303150,1 1,18 1,52 4.277}
{0 CHEMBL1303157,1 1,2 1,27 1,52 4.464}
{0 CHEMBL1303193,1 1,12 1,52 4.233}
{0 CHEMBL1303198,1 1,2 1,52 4.004}
{0 CHEMBL1303520,1 1,52 4.004}
{0 CHEMBL1304092,1 1,27 1,52 4.253}
{0 CHEMBL1307036,1 1,18 1,31 1,52 4.004}
{0 CHEMBL1307648,1 1,52 4.162}
{0 CHEMBL1307956,1 1,7 1,52 4.004}
{0 CHEMBL1309404,1 1,2 1,20 1,38 1,52 4.437}
{0 CHEMBL1309683,1 1,2 1,52 4.004}
{0 CHEMBL1309911,1 1,2 1,24 1,29 1,52 4.389}
{0 CHEMBL1310269,1 1,39 1,52 4.238}
{0 CHEMBL1310631,1 1,2 1,35 1,36 1,52 4.206}
{0 CHEMBL1311260,1 1,12 1,49 1,52 4.004}
{0 CHEMBL1312377,1 1,52 4.517}
{0 CHEMBL1313936,1 1,2 1,24 1,52 4.16}
{0 CHEMBL1313945,1 1,39 1,52 4.208}
{0 CHEMBL1317867,1 1,2 1,35 1,52 4.004}
{0 CHEMBL1318179,39 1,52 4.349}
{0 CHEMBL1319447,1 1,35 1,52 4.004}
{0 CHEMBL1319456,1 1,17 1,49 1,52 4.004}
{0 CHEMBL1322281,1 1,2 1,35 1,52 4.494}
{0 CHEMBL1323268,1 1,2 1,52 4.375}
{0 CHEMBL1323828,1 1,52 4.004}
{0 CHEMBL1324227,1 1,2 1,52 4.413}
{0 CHEMBL1324859,1 1,31 1,52 4.004}
{0 CHEMBL1325286,1 1,16 1,18 1,20 1,26 1,52 4.004}
{0 CHEMBL1325293,1 1,51 1,52 4.075}
{0 CHEMBL1325819,1 1,2 1,52 4.502}
{0 CHEMBL1326748,1 1,13 1,52 4.004}
{0 CHEMBL1327721,1 1,35 1,52 4.18}
{0 CHEMBL1328405,1 1,35 1,38 1,52 4.004}
{0 CHEMBL1328741,39 1,52 4.252}
{0 CHEMBL1330698,1 1,2 1,35 1,43 1,52 4.004}
{0 CHEMBL1333151,1 1,35 1,49 1,52 4.004}
{0 CHEMBL1333238,1 1,24 1,35 1,52 4.004}
{0 CHEMBL1333548,1 1,2 1,35 1,52 4.004}
{0 CHEMBL1334696,1 1,52 4.004}
{0 CHEMBL1336930,1 1,43 1,52 4.004}
{0 CHEMBL1337221,1 1,27 1,35 1,52 4.004}
{0 CHEMBL1338689,1 1,2 1,11 1,52 4.539}
{0 CHEMBL1338930,1 1,52 4.004}
{0 CHEMBL1339166,1 1,52 4.27}
{0 CHEMBL1339765,1 1,24 1,35 1,52 4.004}
{0 CHEMBL1339921,1 1,52 4.004}
{0 CHEMBL1340895,1 1,12 1,24 1,52 4.698}
{0 CHEMBL1341350,1 1,35 1,49 1,52 4.303}
{0 CHEMBL1342485,52 4.004}
{0 CHEMBL1342798,1 1,2 1,52 4.394}
{0 CHEMBL1343099,1 1,36 1,52 4.004}
{0 CHEMBL1343780,1 1,2 1,52 4.004}
{0 CHEMBL1344560,1 1,35 1,52 4.425}
{0 CHEMBL1346297,1 1,2 1,26 1,52 4.004}
{0 CHEMBL1349690,1 1,21 1,26 1,52 4.184}
{0 CHEMBL1350845,1 1,2 1,25 1,52 4.004}
{0 CHEMBL1351618,1 1,36 1,47 1,52 4.029}
{0 CHEMBL1352343,1 1,52 4.318}
{0 CHEMBL1352376,1 1,2 1,18 1,35 1,52 4.004}
{0 CHEMBL1358926,1 1,24 1,35 1,39 1,52 4.195}
{0 CHEMBL1359137,1 1,35 1,52 4.004}
{0 CHEMBL1360606,1 1,33 1,39 1,52 4.004}
{0 CHEMBL1360793,1 1,27 1,47 1,52 4.004}
{0 CHEMBL1361805,1 1,35 1,38 1,52 4.004}
{0 CHEMBL1362667,1 1,49 1,52 4.162}
{0 CHEMBL1364211,1 1,52 4.142}
{0 CHEMBL1365068,1 1,35 1,48 1,52 4.004}
{0 CHEMBL1366122,1 1,49 1,52 4.26}
{0 CHEMBL1366593,1 1,3 1,52 4.355}
{0 CHEMBL1368671,1 1,2 1,35 1,52 4.116}
{0 CHEMBL1369487,21 1,52 4.004}
{0 CHEMBL1370184,1 1,2 1,50 1,52 4.004}
{0 CHEMBL1370456,1 1,28 1,52 4.004}
{0 CHEMBL1371472,1 1,35 1,52 4.137}
{0 CHEMBL1372505,1 1,26 1,52 4.257}
{0 CHEMBL1372792,1 1,35 1,52 4.376}
{0 CHEMBL1374557,1 1,26 1,52 4.004}
{0 CHEMBL1375034,1 1,52 4.004}
{0 CHEMBL1375292,1 1,36 1,52 4.004}
{0 CHEMBL1375904,1 1,52 4.004}
{0 CHEMBL1377943,1 1,35 1,52 4.144}
{0 CHEMBL1379877,1 1,21 1,26 1,35 1,52 4.476}
{0 CHEMBL1379898,1 1,50 1,52 4.004}
{0 CHEMBL1380580,39 1,52 4.004}
{0 CHEMBL1380676,1 1,34 1,39 1,52 4.719}
{0 CHEMBL1381340,1 1,52 4.004}
{0 CHEMBL1381831,1 1,2 1,52 4.004}
{0 CHEMBL1382001,1 1,2 1,26 1,52 4.178}
{0 CHEMBL1382089,1 1,35 1,52 4.303}
{0 CHEMBL1384104,1 1,2 1,52 4.328}
{0 CHEMBL1385897,1 1,35 1,39 1,52 4.004}
{0 CHEMBL1386020,1 1,52 4.004}
{0 CHEMBL1386348,1 1,2 1,27 1,35 1,52 4.158}
{0 CHEMBL1386658,1 1,2 1,8 1,52 4.267}
{0 CHEMBL1386791,1 1,52 4.004}
{0 CHEMBL1386952,1 1,2 1,18 1,27 1,52 4.004}
{0 CHEMBL1389733,1 1,52 4.004}
{0 CHEMBL1389963,1 1,17 1,35 1,52 4.004}
{0 CHEMBL1390551,1 1,2 1,24 1,52 4.004}
{0 CHEMBL1393284,1 1,24 1,52 4.004}
{0 CHEMBL1393310,1 1,36 1,47 1,52 4.004}
{0 CHEMBL1393396,1 1,35 1,52 4.004}
{0 CHEMBL1393520,1 1,7 1,52 4.004}
{0 CHEMBL1394008,1 1,21 1,26 1,49 1,52 4.107}
{0 CHEMBL1398060,1 1,10 1,52 4.212}
{0 CHEMBL1398190,1 1,43 1,52 4.396}
{0 CHEMBL1400989,1 1,40 1,52 4.105}
{0 CHEMBL1401048,1 1,35 1,52 4.004}
{0 CHEMBL1402103,1 1,36 1,52 4.212}
{0 CHEMBL1402149,1 1,51 1,52 4.356}
{0 CHEMBL1403913,1 1,52 4.004}
{0 CHEMBL1405172,1 1,35 1,39 1,52 4.004}
{0 CHEMBL1405274,1 1,52 4.004}
{0 CHEMBL1405729,1 1,2 1,18 1,35 1,52 4.004}
{0 CHEMBL1405900,1 1,24 1,26 1,35 1,52 4.004}
{0 CHEMBL1406911,1 1,52 4.004}
{0 CHEMBL1407274,1 1,27 1,47 1,52 4.004}
{0 CHEMBL1407873,1 1,24 1,52 4.004}
{0 CHEMBL1408741,1 1,52 4.111}
{0 CHEMBL1408828,1 1,35 1,38 1,52 4.004}
{0 CHEMBL1408986,1 1,52 4.004}
{0 CHEMBL1409207,1 1,21 1,26 1,35 1,49 1,52 4.004}
{0 CHEMBL1410465,1 1,35 1,38 1,52 4.004}
{0 CHEMBL1411354,1 1,2 1,11 1,52 4.004}
{0 CHEMBL1411624,1 1,52 4.004}
{0 CHEMBL1411784,1 1,2 1,24 1,52 4.004}
{0 CHEMBL1414655,1 1,24 1,35 1,52 4.004}
{0 CHEMBL1416018,1 1,52 4.004}
{0 CHEMBL1416556,1 1,52 4.004}
{0 CHEMBL1416570,1 1,35 1,52 4.004}
{0 CHEMBL1417553,1 1,2 1,52 4.004}
{0 CHEMBL1419027,1 1,35 1,52 4.004}
{0 CHEMBL1419680,1 1,52 4.257}
{0 CHEMBL1419935,1 1,52 4.25}
{0 CHEMBL1420252,1 1,21 1,26 1,52 4.095}
{0 CHEMBL1420548,1 1,52 4.004}
{0 CHEMBL1421105,1 1,35 1,52 4.004}
{0 CHEMBL1421166,1 1,21 1,39 1,45 1,52 4.004}
{0 CHEMBL1421207,1 1,2 1,52 4.839}
{0 CHEMBL1421456,1 1,2 1,35 1,52 4.004}
{0 CHEMBL1421924,1 1,2 1,4 1,52 4.44}
{0 CHEMBL1422285,1 1,52 4.004}
{0 CHEMBL1422748,1 1,36 1,47 1,52 4.004}
{0 CHEMBL1423165,1 1,21 1,26 1,49 1,52 4.328}
{0 CHEMBL1423797,1 1,21 1,26 1,35 1,49 1,52 4.382}
{0 CHEMBL1423836,1 1,52 4.004}
{0 CHEMBL1425931,1 1,14 1,23 1,24 1,49 1,52 4.329}
{0 CHEMBL1427044,1 1,2 1,24 1,52 4.004}
{0 CHEMBL1428087,1 1,2 1,39 1,52 4.004}
{0 CHEMBL1428271,1 1,52 4.004}
{0 CHEMBL1428589,1 1,2 1,10 1,52 4.223}
{0 CHEMBL1429367,1 1,22 1,52 4.004}
{0 CHEMBL1429676,1 1,43 1,52 4.416}
{0 CHEMBL1430935,1 1,2 1,21 1,26 1,52 4.185}
{0 CHEMBL1431810,1 1,3 1,22 1,52 4.908}
{0 CHEMBL1431909,1 1,35 1,52 4.004}
{0 CHEMBL1431919,1 1,52 4.313}
{0 CHEMBL1432052,1 1,52 4.127}
{0 CHEMBL1432585,1 1,2 1,27 1,35 1,52 4.285}
{0 CHEMBL1432696,1 1,39 1,52 4.264}
{0 CHEMBL1439713,1 1,52 4.004}
{0 CHEMBL1439958,1 1,6 1,8 1,52 4.004}
{0 CHEMBL1440463,1 1,52 4.004}
{0 CHEMBL1441335,1 1,24 1,26 1,39 1,52 4.004}
{0 CHEMBL1441958,1 1,12 1,27 1,52 4.277}
{0 CHEMBL1442704,1 1,2 1,52 4.004}
{0 CHEMBL1443089,1 1,24 1,39 1,52 4.004}
{0 CHEMBL1444791,1 1,52 4.406}
{0 CHEMBL1444979,1 1,36 1,47 1,50 1,52 4.004}
{0 CHEMBL1445617,1 1,4 1,34 1,50 1,52 4.004}
{0 CHEMBL1445858,1 1,13 1,26 1,31 1,52 4.004}
{0 CHEMBL1446234,1 1,2 1,35 1,49 1,52 4.004}
{0 CHEMBL1446410,1 1,51 1,52 4.306}
{0 CHEMBL1447058,1 1,35 1,52 4.004}
{0 CHEMBL1447988,1 1,35 1,52 4.004}
{0 CHEMBL1451351,1 1,24 1,52 4.004}
{0 CHEMBL1452945,1 1,52 4.388}
{0 CHEMBL1453623,1 1,7 1,35 1,44 1,52 4.534}
{0 CHEMBL1454397,1 1,40 1,52 4.004}
{0 CHEMBL1454807,1 1,2 1,35 1,52 4.004}
{0 CHEMBL1455044,1 1,2 1,35 1,39 1,52 4.004}
{0 CHEMBL1456545,1 1,23 1,52 4.605}
{0 CHEMBL1456548,1 1,16 1,18 1,20 1,26 1,52 4.004}
{0 CHEMBL1457252,1 1,52 4.699}
{0 CHEMBL1457774,1 1,52 4.107}
{0 CHEMBL1459196,1 1,27 1,47 1,52 4.004}
{0 CHEMBL1459316,1 1,52 4.004}
{0 CHEMBL1459317,1 1,20 1,52 4.004}
{0 CHEMBL1460092,1 1,27 1,52 4.156}
{0 CHEMBL1461287,1 1,2 1,24 1,52 4.004}
{0 CHEMBL1462078,1 1,2 1,26 1,52 4.463}
{0 CHEMBL1462708,1 1,2 1,24 1,26 1,39 1,52 4.175}
{0 CHEMBL1462918,1 1,52 4.395}
{0 CHEMBL1463189,1 1,52 4.144}
{0 CHEMBL1463624,1 1,31 1,35 1,52 4.004}
{0 CHEMBL1463714,1 1,52 4.221}
{0 CHEMBL1465106,1 1,35 1,52 4.004}
{0 CHEMBL1465435,1 1,35 1,36 1,52 4.004}
{0 CHEMBL1465727,1 1,27 1,52 4.004}
{0 CHEMBL1466606,1 1,38 1,52 4.206}
{0 CHEMBL1468444,1 1,52 4.004}
{0 CHEMBL1469032,1 1,52 4.004}
{0 CHEMBL1469894,1 1,2 1,35 1,52 4.004}
{0 CHEMBL1473591,1 1,52 4.34}
{0 CHEMBL1476029,1 1,52 4.169}
{0 CHEMBL1477656,1 1,2 1,5 1,18 1,35 1,52 4.359}
{0 CHEMBL1477749,1 1,24 1,52 4.048}
{0 CHEMBL1479103,1 1,28 1,52 4.33}
{0 CHEMBL1480157,1 1,27 1,52 4.004}
{0 CHEMBL1480971,1 1,2 1,35 1,52 4.004}
{0 CHEMBL1481671,1 1,52 4.03}
{0 CHEMBL1481938,1 1,50 1,52 4.004}
{0 CHEMBL1482878,1 1,52 4.309}
{0 CHEMBL1482959,1 1,52 4.004}
{0 CHEMBL1483095,1 1,51 1,52 4.15}
{0 CHEMBL1483453,1 1,52 4.004}
{0 CHEMBL1484293,1 1,52 4.27}
{0 CHEMBL1484508,1 1,35 1,52 4.004}
{0 CHEMBL1486503,1 1,27 1,52 4.314}
{0 CHEMBL1486531,1 1,2 1,24 1,52 4.004}
{0 CHEMBL1487380,1 1,35 1,52 4.004}
{0 CHEMBL1487625,1 1,35 1,52 4.242}
{0 CHEMBL1487912,1 1,52 4.004}
{0 CHEMBL1487921,1 1,35 1,39 1,52 4.004}
{0 CHEMBL1488420,1 1,2 1,52 4.004}
{0 CHEMBL1488551,1 1,52 4.004}
{0 CHEMBL1490734,1 1,2 1,52 4.004}
{0 CHEMBL1491210,1 1,2 1,24 1,52 4.288}
{0 CHEMBL1492158,1 1,7 1,35 1,52 4.161}
{0 CHEMBL1492819,1 1,52 4.04}
{0 CHEMBL1497357,1 1,16 1,18 1,20 1,26 1,52 4.004}
{0 CHEMBL1497574,1 1,25 1,35 1,52 4.004}
{0 CHEMBL1497581,1 1,52 4.047}
{0 CHEMBL1499248,1 1,2 1,4 1,16 1,50 1,52 4.004}
{0 CHEMBL1499361,1 1,35 1,52 4.039}
{0 CHEMBL1499390,1 1,52 4.004}
{0 CHEMBL1499508,1 1,2 1,52 4.119}
{0 CHEMBL1500423,1 1,35 1,52 4.004}
{0 CHEMBL1500904,1 1,35 1,52 4.004}
{0 CHEMBL1501108,1 1,24 1,46 1,52 4.004}
{0 CHEMBL1501146,1 1,3 1,52 4.004}
{0 CHEMBL1502526,1 1,7 1,52 4.127}
{0 CHEMBL1502554,1 1,30 1,39 1,52 4.004}
{0 CHEMBL1503442,1 1,52 4.151}
{0 CHEMBL1503639,1 1,21 1,26 1,52 4.136}
{0 CHEMBL1504624,1 1,2 1,52 4.191}
{0 CHEMBL1505608,1 1,27 1,52 4.037}
{0 CHEMBL1505747,1 1,35 1,52 4.011}
{0 CHEMBL1506476,1 1,4 1,50 1,52 4.004}
{0 CHEMBL1506849,1 1,51 1,52 4.004}
{0 CHEMBL1508724,1 1,35 1,52 4.004}
{0 CHEMBL1509830,1 1,24 1,39 1,52 4.004}
{0 CHEMBL1510614,1 1,35 1,39 1,52 4.197}
{0 CHEMBL1512498,1 1,52 4.145}
{0 CHEMBL1513083,1 1,24 1,52 4.043}
{0 CHEMBL1514705,1 1,43 1,52 4.004}
{0 CHEMBL1516186,1 1,8 1,52 4.296}
{0 CHEMBL1517176,1 1,35 1,52 4.004}
{0 CHEMBL1517376,1 1,20 1,51 1,52 4.004}
{0 CHEMBL1518508,1 1,36 1,47 1,50 1,52 4.004}
{0 CHEMBL1521250,1 1,35 1,52 4.282}
{0 CHEMBL1521461,1 1,36 1,47 1,52 4.004}
{0 CHEMBL1522724,1 1,35 1,52 4.004}
{0 CHEMBL1522986,1 1,35 1,52 4.004}
{0 CHEMBL1523044,1 1,33 1,39 1,52 4.004}
{0 CHEMBL1523192,1 1,52 4.004}
{0 CHEMBL1523597,38 1,52 4.004}
{0 CHEMBL1523652,52 4.004}
{0 CHEMBL1524630,1 1,52 4.004}
{0 CHEMBL1526682,1 1,2 1,52 4.004}
{0 CHEMBL1528991,1 1,52 4.259}
{0 CHEMBL1529418,1 1,34 1,52 4.004}
{0 CHEMBL1531495,39 1,52 4.134}
{0 CHEMBL1532662,1 1,31 1,52 4.004}
{0 CHEMBL1532783,1 1,52 4.004}
{0 CHEMBL1533083,1 1,8 1,52 4.004}
{0 CHEMBL1533337,1 1,27 1,38 1,52 4.095}
{0 CHEMBL1534294,1 1,2 1,52 4.004}
{0 CHEMBL1535241,1 1,2 1,45 1,52 4.351}
{0 CHEMBL1536490,1 1,3 1,35 1,38 1,52 4.004}
{0 CHEMBL1537639,1 1,52 4.054}
{0 CHEMBL1538590,39 1,52 4.172}
{0 CHEMBL1539384,1 1,3 1,12 1,35 1,52 4.004}
{0 CHEMBL1539653,1 1,2 1,31 1,52 4.004}
{0 CHEMBL1540094,1 1,25 1,36 1,52 4.004}
{0 CHEMBL1540841,1 1,21 1,26 1,52 4.004}
{0 CHEMBL1542591,1 1,24 1,52 4.004}
{0 CHEMBL1543005,1 1,52 4.225}
{0 CHEMBL1543229,1 1,21 1,26 1,35 1,52 4.134}
{0 CHEMBL1543509,1 1,52 4.167}
{0 CHEMBL1545489,1 1,7 1,26 1,52 4.004}
{0 CHEMBL1546706,1 1,24 1,27 1,52 4.031}
{0 CHEMBL1546791,1 1,12 1,52 4.129}
{0 CHEMBL1548789,1 1,35 1,52 4.004}
{0 CHEMBL1551560,1 1,24 1,52 4.333}
{0 CHEMBL1553691,1 1,52 4.432}
{0 CHEMBL1555050,1 1,52 4.253}
{0 CHEMBL1556750,1 1,52 4.109}
{0 CHEMBL1557186,1 1,52 4.004}
{0 CHEMBL1558403,1 1,3 1,35 1,52 4.004}
{0 CHEMBL1558832,1 1,52 4.004}
{0 CHEMBL1558977,1 1,38 1,52 4.197}
{0 CHEMBL1559256,1 1,27 1,52 4.356}
{0 CHEMBL1559324,1 1,2 1,27 1,49 1,52 4.004}
{0 CHEMBL1561287,1 1,21 1,35 1,52 4.004}
{0 CHEMBL1566130,1 1,2 1,31 1,37 1,52 4.004}
{0 CHEMBL1567518,1 1,2 1,11 1,52 4.004}
{0 CHEMBL1567597,1 1,52 4.291}
{0 CHEMBL1569794,1 1,35 1,52 4.004}
{0 CHEMBL1569865,1 1,52 4.004}
{0 CHEMBL1570427,1 1,52 4.004}
{0 CHEMBL1572588,1 1,2 1,18 1,35 1,52 4.004}
{0 CHEMBL1572627,1 1,52 4.004}
{0 CHEMBL1572785,1 1,52 4.026}
{0 CHEMBL1573198,1 1,21 1,26 1,35 1,46 1,52 4.004}
{0 CHEMBL1573304,1 1,23 1,52 4.045}
{0 CHEMBL1573707,1 1,36 1,47 1,52 4.168}
{0 CHEMBL1574438,1 1,4 1,19 1,24 1,52 4.182}
{0 CHEMBL1576364,1 1,2 1,27 1,52 4.004}
{0 CHEMBL1576540,1 1,35 1,39 1,52 4.004}
{0 CHEMBL1576642,1 1,2 1,35 1,52 4.004}
{0 CHEMBL1576646,1 1,2 1,25 1,52 4.004}
{0 CHEMBL1576943,1 1,35 1,52 4.363}
{0 CHEMBL1577333,1 1,2 1,35 1,52 4.004}
{0 CHEMBL1577981,1 1,12 1,52 4.004}
{0 CHEMBL1578039,1 1,2 1,25 1,52 4.128}
{0 CHEMBL1578141,1 1,35 1,52 4.179}
{0 CHEMBL1578178,1 1,52 4.004}
{0 CHEMBL1578612,1 1,52 4.835}
{0 CHEMBL1578643,1 1,35 1,52 4.029}
{0 CHEMBL1578806,1 1,17 1,35 1,52 4.004}
{0 CHEMBL1579116,1 1,52 4.313}
{0 CHEMBL1579898,1 1,46 1,52 4.004}
{0 CHEMBL1580198,1 1,52 4.347}
{0 CHEMBL1580407,1 1,27 1,36 1,52 4.271}
{0 CHEMBL1580472,1 1,27 1,47 1,52 4.004}
{0 CHEMBL1582131,1 1,37 1,50 1,52 4.526}
{0 CHEMBL1582416,1 1,31 1,36 1,52 4.004}
{0 CHEMBL1582996,1 1,35 1,52 4.267}
{0 CHEMBL1583067,1 1,35 1,52 4.004}
{0 CHEMBL1583552,1 1,2 1,52 4.004}
{0 CHEMBL1583844,1 1,52 4.004}
{0 CHEMBL1583907,52 4.004}
{0 CHEMBL1584115,1 1,2 1,35 1,52 4.004}
{0 CHEMBL1585226,1 1,2 1,27 1,52 4.443}
{0 CHEMBL1585764,1 1,2 1,52 4.004}
{0 CHEMBL1587083,1 1,39 1,52 4.004}
{0 CHEMBL1587434,1 1,2 1,52 4.004}
{0 CHEMBL1591513,1 1,2 1,7 1,24 1,52 4.188}
{0 CHEMBL1594756,1 1,28 1,35 1,52 4.004}
{0 CHEMBL1594826,1 1,52 4.004}
{0 CHEMBL1595871,1 1,2 1,21 1,26 1,52 4.004}
{0 CHEMBL1595909,52 4.004}
{0 CHEMBL1597246,1 1,7 1,9 1,35 1,52 4.004}
{0 CHEMBL1598441,1 1,21 1,26 1,49 1,52 4.49}
{0 CHEMBL1598493,1 1,35 1,48 1,52 4.004}
{0 CHEMBL1598538,1 1,52 4.179}
{0 CHEMBL1598745,1 1,24 1,34 1,52 4.064}
{0 CHEMBL1599761,39 1,52 4.004}
{0 CHEMBL1601348,1 1,37 1,52 4.004}
{0 CHEMBL1601846,1 1,52 4.049}
{0 CHEMBL1602261,1 1,35 1,52 4.422}
{0 CHEMBL1604953,1 1,35 1,49 1,52 4.004}
{0 CHEMBL1605363,1 1,35 1,38 1,52 4.442}
{0 CHEMBL1605468,1 1,13 1,36 1,52 4.004}
{0 CHEMBL1605813,38 1,44 1,52 4.004}
{0 CHEMBL1606773,1 1,26 1,52 4.004}
{0 CHEMBL1608989,1 1,35 1,38 1,52 4.004}
{0 CHEMBL1609003,1 1,50 1,52 4.259}
{0 CHEMBL1610395,1 1,2 1,52 4.494}
{0 CHEMBL1610433,1 1,52 4.631}
{0 CHEMBL1611002,1 1,25 1,52 4.004}
{0 CHEMBL1611662,1 1,38 1,52 4.004}
{0 CHEMBL1612672,1 1,21 1,26 1,49 1,52 4.004}
{0 CHEMBL1612843,1 1,2 1,26 1,39 1,52 4.004}
{0 CHEMBL1613256,1 1,8 1,52 4.267}
{0 CHEMBL1697963,1 1,2 1,27 1,35 1,52 4.323}
{0 CHEMBL1698604,1 1,23 1,39 1,52 4.004}
{0 CHEMBL1702248,1 1,52 4.004}
{0 CHEMBL1702350,1 1,2 1,35 1,39 1,52 4.004}
{0 CHEMBL1705345,1 1,2 1,4 1,26 1,35 1,52 4.004}
{0 CHEMBL1710856,1 1,24 1,39 1,52 4.199}
{0 CHEMBL1713837,1 1,36 1,52 4.344}
{0 CHEMBL1714260,1 1,27 1,52 4.004}
{0 CHEMBL1714498,1 1,20 1,24 1,52 4.194}
{0 CHEMBL1720248,1 1,24 1,25 1,39 1,52 4.079}
{0 CHEMBL1721095,1 1,52 4.004}
{0 CHEMBL1722129,1 1,39 1,52 4.174}
{0 CHEMBL1723047,1 1,35 1,52 4.004}
{0 CHEMBL1723854,1 1,7 1,52 4.004}
{0 CHEMBL1724655,1 1,35 1,38 1,52 4.004}
{0 CHEMBL1727519,1 1,7 1,52 4.004}
{0 CHEMBL1728023,1 1,29 1,52 4.004}
{0 CHEMBL1734383,1 1,7 1,52 4.004}
{0 CHEMBL1863847,1 1,2 1,18 1,24 1,35 1,52 4.004}
{0 CHEMBL1863914,1 1,7 1,24 1,52 4.355}
{0 CHEMBL1864111,1 1,52 4.004}
{0 CHEMBL1866444,1 1,2 1,4 1,35 1,52 4.004}
{0 CHEMBL1867926,1 1,39 1,52 4.004}
{0 CHEMBL1868381,1 1,34 1,52 4.511}
{0 CHEMBL1868444,1 1,20 1,24 1,52 4.312}
{0 CHEMBL1873191,1 1,52 4.004}
{0 CHEMBL1874087,1 1,16 1,26 1,52 4.004}
{0 CHEMBL1875552,1 1,2 1,52 4.004}
{0 CHEMBL1878187,1 1,2 1,29 1,35 1,52 4.004}
{0 CHEMBL1881583,1 1,2 1,52 4.658}
{0 CHEMBL1883085,1 1,39 1,52 4.004}
{0 CHEMBL1884882,1 1,36 1,52 4.004}
{0 CHEMBL1885064,1 1,52 4.004}
{0 CHEMBL1885471,1 1,2 1,18 1,24 1,52 4.004}
{0 CHEMBL1892727,1 1,52 4.004}
{0 CHEMBL1896512,1 1,52 4.024}
{0 CHEMBL1897572,1 1,24 1,52 4.27}
{0 CHEMBL1898065,1 1,52 4.203}
{0 CHEMBL1901790,1 1,52 4.004}
{0 CHEMBL1902460,1 1,28 1,39 1,43 1,52 4.125}
{0 CHEMBL1964868,1 1,52 4.361}
{0 CHEMBL1967726,1 1,4 1,30 1,50 1,52 4.004}
{0 CHEMBL1970711,1 1,52 4.004}
{0 CHEMBL1971324,1 1,24 1,39 1,52 4.004}
{0 CHEMBL1972014,1 1,52 4.138}
{0 CHEMBL1973694,1 1,2 1,52 4.18}
{0 CHEMBL1975523,1 1,25 1,52 4.004}
{0 CHEMBL1976280,1 1,31 1,52 4.315}
{0 CHEMBL1976839,1 1,25 1,52 4.004}
{0 CHEMBL1978330,1 1,24 1,52 4.004}
{0 CHEMBL1981303,1 1,2 1,7 1,24 1,52 4.004}
{0 CHEMBL1981833,1 1,52 4.004}
{0 CHEMBL1983116,1 1,17 1,26 1,52 4.256}
{0 CHEMBL1984348,1 1,2 1,52 4.029}
{0 CHEMBL1984796,1 1,52 4.004}
{0 CHEMBL1985338,1 1,39 1,52 4.004}
{0 CHEMBL1987483,1 1,31 1,52 4.004}
{0 CHEMBL1991136,1 1,7 1,24 1,44 1,52 4.004}
{0 CHEMBL1992719,1 1,35 1,52 4.304}
{0 CHEMBL1994266,1 1,2 1,52 4.004}
{0 CHEMBL1995385,1 1,52 4.087}
{0 CHEMBL1995922,1 1,19 1,52 4.004}
{0 CHEMBL1996363,1 1,50 1,52 4.212}
{0 CHEMBL1997740,1 1,2 1,18 1,24 1,39 1,52 4.004}
{0 CHEMBL1998893,1 1,24 1,39 1,52 4.291}
{0 CHEMBL2001481,1 1,52 4.289}
{0 CHEMBL2003831,1 1,24 1,39 1,52 4.285}
{0 CHEMBL2003840,1 1,2 1,52 4.227}
{0 CHEMBL2005703,1 1,27 1,52 4.004}
{0 CHEMBL2007056,1 1,52 4.332}
{0 CHEMBL240332,1 1,27 1,52 4.177}
{0 CHEMBL268584,1 1,26 1,52 4.004}
{0 CHEMBL41286,1 1,15 1,24 1,52 4.004}
{0 CHEMBL428496,1 1,52 4.004}
{0 CHEMBL457679,1 1,24 1,29 1,52 4.429}
{0 CHEMBL481577,1 1,35 1,52 4.212}
{0 CHEMBL495991,1 1,2 1,50 1,52 4.004}
{0 CHEMBL505670,41 1,52 4.004}
{0 CHEMBL512216,1 1,37 1,50 1,52 4.552}
{0 CHEMBL518575,1 1,39 1,52 4.313}
{0 CHEMBL521762,1 1,23 1,52 4.172}
{0 CHEMBL538104,1 1,14 1,52 4.262}
{0 CHEMBL584246,1 1,7 1,52 4.036}
{0 CHEMBL600034,1 1,27 1,52 4.004}
{0 CHEMBL66953,1 1,29 1,36 1,52 4.05}
{0 CHEMBL69863,1 1,52 4.004}
