{
  "data_qualities": {
    "quality": [
      {
        "name": "AutoCorrelation",
        "value": "0.10008510008510009"
      },
      {
        "name": "CfsSubsetEval_DecisionStumpAUC",
        "value": "0.85175133965445"
      },
      {
        "name": "CfsSubsetEval_DecisionStumpErrRate",
        "value": "0.290905"
      },
      {
        "name": "CfsSubsetEval_DecisionStumpKappa",
        "value": "0.6767716935011607"
      },
      {
        "name": "CfsSubsetEval_NaiveBayesAUC",
        "value": "0.85175133965445"
      },
      {
        "name": "CfsSubsetEval_NaiveBayesErrRate",
        "value": "0.290905"
      },
      {
        "name": "CfsSubsetEval_NaiveBayesKappa",
        "value": "0.6767716935011607"
      },
      {
        "name": "CfsSubsetEval_kNN1NAUC",
        "value": "0.85175133965445"
      },
      {
        "name": "CfsSubsetEval_kNN1NErrRate",
        "value": "0.290905"
      },
      {
        "name": "CfsSubsetEval_kNN1NKappa",
        "value": "0.6767716935011607"
      },
      {
        "name": "ClassEntropy",
        "value": "3.3219261584997604"
      },
      {
        "name": "DecisionStumpAUC",
        "value": "0.6754668115933892"
      },
      {
        "name": "DecisionStumpErrRate",
        "value": "0.812069"
      },
      {
        "name": "DecisionStumpKappa",
        "value": "0.09753866894690903"
      },
      {
        "name": "Dimensionality",
        "value": "4.8E-5"
      },
      {
        "name": "EquivalentNumberOfAtts",
        "value": []
      },
      {
        "name": "J48.00001.AUC",
        "value": "0.849088585771426"
      },
      {
        "name": "J48.00001.ErrRate",
        "value": "0.290867"
      },
      {
        "name": "J48.00001.Kappa",
        "value": "0.676813849289966"
      },
      {
        "name": "J48.0001.AUC",
        "value": "0.849088585771426"
      },
      {
        "name": "J48.0001.ErrRate",
        "value": "0.290867"
      },
      {
        "name": "J48.0001.Kappa",
        "value": "0.676813849289966"
      },
      {
        "name": "J48.001.AUC",
        "value": "0.849088585771426"
      },
      {
        "name": "J48.001.ErrRate",
        "value": "0.290867"
      },
      {
        "name": "J48.001.Kappa",
        "value": "0.676813849289966"
      },
      {
        "name": "MajorityClassPercentage",
        "value": "10.0289"
      },
      {
        "name": "MajorityClassSize",
        "value": "100289.0"
      },
      {
        "name": "MaxAttributeEntropy",
        "value": []
      },
      {
        "name": "MaxKurtosisOfNumericAtts",
        "value": "2.233970518023533"
      },
      {
        "name": "MaxMeansOfNumericAtts",
        "value": "507.70880623642"
      },
      {
        "name": "MaxMutualInformation",
        "value": []
      },
      {
        "name": "MaxNominalAttDistinctValues",
        "value": "10.0"
      },
      {
        "name": "MaxSkewnessOfNumericAtts",
        "value": "1.5034817027716705"
      },
      {
        "name": "MaxStdDevOfNumericAtts",
        "value": "124.1855282325309"
      },
      {
        "name": "MeanAttributeEntropy",
        "value": []
      },
      {
        "name": "MeanKurtosisOfNumericAtts",
        "value": "0.28951301210976677"
      },
      {
        "name": "MeanMeansOfNumericAtts",
        "value": "88.12085155366289"
      },
      {
        "name": "MeanMutualInformation",
        "value": []
      },
      {
        "name": "MeanNoiseToSignalRatio",
        "value": []
      },
      {
        "name": "MeanNominalAttDistinctValues",
        "value": "10.0"
      },
      {
        "name": "MeanSkewnessOfNumericAtts",
        "value": "0.7479523196167397"
      },
      {
        "name": "MeanStdDevOfNumericAtts",
        "value": "39.712310030701126"
      },
      {
        "name": "MinAttributeEntropy",
        "value": []
      },
      {
        "name": "MinKurtosisOfNumericAtts",
        "value": "-0.9782672605059473"
      },
      {
        "name": "MinMeansOfNumericAtts",
        "value": "0.078578113189"
      },
      {
        "name": "MinMutualInformation",
        "value": []
      },
      {
        "name": "MinNominalAttDistinctValues",
        "value": "10.0"
      },
      {
        "name": "MinSkewnessOfNumericAtts",
        "value": "0.01647016113950717"
      },
      {
        "name": "MinStdDevOfNumericAtts",
        "value": "0.06662622791953339"
      },
      {
        "name": "MinorityClassPercentage",
        "value": "9.9797"
      },
      {
        "name": "MinorityClassSize",
        "value": "99797.0"
      },
      {
        "name": "NaiveBayesAUC",
        "value": "0.9529759652602074"
      },
      {
        "name": "NaiveBayesErrRate",
        "value": "0.30974"
      },
      {
        "name": "NaiveBayesKappa",
        "value": "0.6558491286808068"
      },
      {
        "name": "NumberOfBinaryFeatures",
        "value": "0.0"
      },
      {
        "name": "NumberOfClasses",
        "value": "10.0"
      },
      {
        "name": "NumberOfFeatures",
        "value": "48.0"
      },
      {
        "name": "NumberOfInstances",
        "value": "1000000.0"
      },
      {
        "name": "NumberOfInstancesWithMissingValues",
        "value": "0.0"
      },
      {
        "name": "NumberOfMissingValues",
        "value": "0.0"
      },
      {
        "name": "NumberOfNumericFeatures",
        "value": "47.0"
      },
      {
        "name": "NumberOfSymbolicFeatures",
        "value": "1.0"
      },
      {
        "name": "PercentageOfBinaryFeatures",
        "value": "0.0"
      },
      {
        "name": "PercentageOfInstancesWithMissingValues",
        "value": "0.0"
      },
      {
        "name": "PercentageOfMissingValues",
        "value": "0.0"
      },
      {
        "name": "PercentageOfNumericFeatures",
        "value": "97.91666666666666"
      },
      {
        "name": "PercentageOfSymbolicFeatures",
        "value": "2.083333333333333"
      },
      {
        "name": "Quartile1AttributeEntropy",
        "value": []
      },
      {
        "name": "Quartile1KurtosisOfNumericAtts",
        "value": "-0.557033653469754"
      },
      {
        "name": "Quartile1MeansOfNumericAtts",
        "value": "7.3240318655120005"
      },
      {
        "name": "Quartile1MutualInformation",
        "value": []
      },
      {
        "name": "Quartile1SkewnessOfNumericAtts",
        "value": "0.37749189297088553"
      },
      {
        "name": "Quartile1StdDevOfNumericAtts",
        "value": "3.520743342449164"
      },
      {
        "name": "Quartile2AttributeEntropy",
        "value": []
      },
      {
        "name": "Quartile2KurtosisOfNumericAtts",
        "value": "0.023982765584618093"
      },
      {
        "name": "Quartile2MeansOfNumericAtts",
        "value": "68.78292971411099"
      },
      {
        "name": "Quartile2MutualInformation",
        "value": []
      },
      {
        "name": "Quartile2SkewnessOfNumericAtts",
        "value": "0.7367392622784438"
      },
      {
        "name": "Quartile2StdDevOfNumericAtts",
        "value": "37.10292199410516"
      },
      {
        "name": "Quartile3AttributeEntropy",
        "value": []
      },
      {
        "name": "Quartile3KurtosisOfNumericAtts",
        "value": "1.1153519446718891"
      },
      {
        "name": "Quartile3MeansOfNumericAtts",
        "value": "126.526860062867"
      },
      {
        "name": "Quartile3MutualInformation",
        "value": []
      },
      {
        "name": "Quartile3SkewnessOfNumericAtts",
        "value": "1.1253213168970015"
      },
      {
        "name": "Quartile3StdDevOfNumericAtts",
        "value": "64.82513915389295"
      },
      {
        "name": "REPTreeDepth1AUC",
        "value": "0.9369537126524267"
      },
      {
        "name": "REPTreeDepth1ErrRate",
        "value": "0.271281"
      },
      {
        "name": "REPTreeDepth1Kappa",
        "value": "0.6985768944698579"
      },
      {
        "name": "REPTreeDepth2AUC",
        "value": "0.9369537126524267"
      },
      {
        "name": "REPTreeDepth2ErrRate",
        "value": "0.271281"
      },
      {
        "name": "REPTreeDepth2Kappa",
        "value": "0.6985768944698579"
      },
      {
        "name": "REPTreeDepth3AUC",
        "value": "0.9369537126524267"
      },
      {
        "name": "REPTreeDepth3ErrRate",
        "value": "0.271281"
      },
      {
        "name": "REPTreeDepth3Kappa",
        "value": "0.6985768944698579"
      },
      {
        "name": "RandomTreeDepth1AUC",
        "value": "0.8057229966595045"
      },
      {
        "name": "RandomTreeDepth1ErrRate",
        "value": "0.349693"
      },
      {
        "name": "RandomTreeDepth1Kappa",
        "value": "0.6114522203235186"
      },
      {
        "name": "RandomTreeDepth2AUC",
        "value": "0.8057229966595045"
      },
      {
        "name": "RandomTreeDepth2ErrRate",
        "value": "0.349693"
      },
      {
        "name": "RandomTreeDepth2Kappa",
        "value": "0.6114522203235186"
      },
      {
        "name": "RandomTreeDepth3AUC",
        "value": "0.8057229966595045"
      },
      {
        "name": "RandomTreeDepth3ErrRate",
        "value": "0.349693"
      },
      {
        "name": "RandomTreeDepth3Kappa",
        "value": "0.6114522203235186"
      },
      {
        "name": "StdvNominalAttDistinctValues",
        "value": "0.0"
      },
      {
        "name": "kNN1NAUC",
        "value": "0.8508827901265956"
      },
      {
        "name": "kNN1NErrRate",
        "value": "0.268404"
      },
      {
        "name": "kNN1NKappa",
        "value": "0.7017730453385455"
      }
    ]
  }
}