{
  "data_set_description": {
    "collection_date": "November 2013",
    "creator": "Dr Jeremy Besnard, Dr Ivan Olier, Dr Noureddin Sadawi, Dr Larisa Soldatova, Dr Crina Grosan, Prof Ross King, Dr Richard Bickerton, Prof Andrew Hopkins and Dr Willem van Hoorn",
    "default_target_attribute": "pXC50",
    "description": "This dataset contains QSAR data (from ChEMBL version 17) showing activity values (unit is pseudo-pCI50) of several compounds on drug target ChEMBL_ID: CHEMBL2553 (TID: 10929), and it has 154 rows and 43 features (not including molecule IDs and class feature: molecule_id and pXC50). The features represent Basic Molecular Descriptors which were generated from SMILES strings.  Missing value imputation was applied to this dataset (By choosing the Median).",
    "description_version": "1",
    "file_id": "3270906",
    "format": "ARFF",
    "id": "25363",
    "licence": "Public",
    "md5_checksum": "8e23080616e0d3523f6c38c8ec48dbad",
    "minio_url": "https://data.openml.org/datasets/0002/25363/dataset_25363.pq",
    "name": "QSAR-DATASET-FOR-DRUG-TARGET-CHEMBL2553",
    "original_data_url": "https://www.ebi.ac.uk/chembl/target/inspect/CHEMBL2553",
    "parquet_url": "https://data.openml.org/datasets/0002/25363/dataset_25363.pq",
    "processing_date": "2018-10-03 23:07:56",
    "row_id_attribute": "molecule_id",
    "status": "deactivated",
    "tag": [
      "MetaQSAR",
      "study_13"
    ],
    "upload_date": "2016-07-14T16:45:25",
    "url": "https://api.openml.org/data/v1/download/3270906/QSAR-DATASET-FOR-DRUG-TARGET-CHEMBL2553.arff",
    "version": "7",
    "visibility": "public"
  }
}