"molecule_id","FCFP4_1024b495","FCFP4_1024b632","FCFP4_1024b1","FCFP4_1024b10","FCFP4_1024b100","FCFP4_1024b1000","FCFP4_1024b1001","FCFP4_1024b1002","FCFP4_1024b1003","FCFP4_1024b1004","FCFP4_1024b1005","FCFP4_1024b1006","FCFP4_1024b1007","FCFP4_1024b1008","FCFP4_1024b1009","FCFP4_1024b101","FCFP4_1024b1010","FCFP4_1024b1011","FCFP4_1024b1012","FCFP4_1024b1013","FCFP4_1024b1014","FCFP4_1024b1015","FCFP4_1024b1016","FCFP4_1024b1017","FCFP4_1024b1018","FCFP4_1024b1019","FCFP4_1024b102","FCFP4_1024b1020","FCFP4_1024b1021","FCFP4_1024b1022","FCFP4_1024b1023","FCFP4_1024b1024","FCFP4_1024b103","FCFP4_1024b104","FCFP4_1024b105","FCFP4_1024b106","FCFP4_1024b107","FCFP4_1024b108","FCFP4_1024b109","FCFP4_1024b11","FCFP4_1024b110","FCFP4_1024b111","FCFP4_1024b112","FCFP4_1024b113","FCFP4_1024b114","FCFP4_1024b115","FCFP4_1024b116","FCFP4_1024b117","FCFP4_1024b118","FCFP4_1024b119","FCFP4_1024b12","pXC50"
{3 1,6 1,37 1,52 6.721}
{0 CHEMBL2207426,3 1,37 1,38 1,52 5.556}
{0 CHEMBL2207427,3 1,37 1,52 6.276}
{0 CHEMBL2207428,3 1,37 1,52 5.116}
{0 CHEMBL2207429,3 1,37 1,52 6.257}
{0 CHEMBL2207430,3 1,37 1,52 6.548}
{0 CHEMBL2207432,3 1,6 1,37 1,52 6.217}
{0 CHEMBL2207433,3 1,6 1,37 1,52 6.281}
{0 CHEMBL2207435,3 1,6 1,37 1,52 5.328}
{0 CHEMBL2207436,3 1,6 1,37 1,52 5.444}
{0 CHEMBL2207437,3 1,6 1,37 1,52 5.602}
{0 CHEMBL2207438,3 1,6 1,10 1,37 1,52 6.484}
{0 CHEMBL2207439,3 1,6 1,37 1,52 6.627}
{0 CHEMBL2207440,1 1,2 1,3 1,6 1,37 1,52 7.009}
{0 CHEMBL2207441,1 1,2 1,3 1,6 1,37 1,52 7.208}
{0 CHEMBL2207823,3 1,37 1,52 6.577}
{0 CHEMBL570380,1 1,2 1,3 1,37 1,52 8}
{0 CHEMBL585927,1 1,2 1,3 1,37 1,38 1,52 8}
