"molecule_id","AMW","C.","H.","Me","Mi","Mp","Mv","MW","N.","nAB","nAT","nB","nBM","nBO","nBR","nBT","nC","nCL","nCsp","nCsp2","nCsp3","nDB","nF","nH","nHet","nHM","nI","nN","nO","nP","nS","nSK","nTB","nX","O.","RBF","RBN","SCBO","Se","Si","Sp","Sv","X.","pXC50"
{1 6.224,2 35.7,3 54.8,4 0.987,5 1.139,6 0.621,7 0.573,8 261.41,9 7.1,10 6,11 42,13 7,14 20,16 43,17 15,20 7,21 8,22 1,24 23,25 4,28 3,29 1,32 19,35 2.4,36 0.186,37 8,38 24,39 41.469,40 47.856,41 26.086,42 24.047,44 5}
{0 CHEMBL108043,1 6.121,2 35.6,3 55.6,4 0.986,5 1.139,6 0.619,7 0.568,8 275.44,9 6.7,10 6,11 45,13 7,14 21,16 46,17 16,20 7,21 9,22 1,24 25,25 4,28 3,29 1,32 20,35 2.2,36 0.196,37 9,38 25,39 44.352,40 51.272,41 27.847,42 25.574,44 5.328}
{0 CHEMBL113919,1 6.839,2 44.7,3 48.9,4 0.989,5 1.117,6 0.666,7 0.622,8 321.45,9 2.1,10 12,11 47,13 14,14 26,16 49,17 21,20 15,21 6,22 2,24 23,25 3,28 1,29 2,32 24,35 4.3,36 0.082,37 4,38 34,39 46.476,40 52.484,41 31.29,42 29.246,44 6.796}
{0 CHEMBL123908,1 7.116,2 44.7,3 46.8,4 0.993,5 1.118,6 0.671,7 0.633,8 334.45,9 4.3,10 16,11 47,13 17,14 28,16 50,17 21,20 15,21 6,22 1,24 22,25 4,28 2,29 2,32 25,35 4.3,36 0.06,37 3,38 37,39 46.694,40 52.567,41 31.534,42 29.74,44 6.602}
{0 CHEMBL124516,1 7.301,2 43.8,3 45.8,4 1,5 1.12,6 0.666,7 0.634,8 350.45,9 4.2,10 16,11 48,13 17,14 29,16 51,17 21,20 15,21 6,22 1,24 22,25 5,28 2,29 3,32 26,35 6.3,36 0.059,37 3,38 38,39 48.022,40 53.777,41 31.989,42 30.455,44 6.975}
{0 CHEMBL124873,1 7.116,2 44.7,3 46.8,4 0.993,5 1.118,6 0.671,7 0.633,8 334.45,9 4.3,10 16,11 47,13 17,14 28,16 50,17 21,20 15,21 6,22 1,24 22,25 4,28 2,29 2,32 25,35 4.3,36 0.06,37 3,38 37,39 46.694,40 52.567,41 31.534,42 29.74,44 7.771}
{0 CHEMBL126228,1 7.116,2 44.7,3 46.8,4 0.993,5 1.118,6 0.671,7 0.633,8 334.45,9 4.3,10 16,11 47,13 17,14 28,16 50,17 21,20 15,21 6,22 1,24 22,25 4,28 2,29 2,32 25,35 4.3,36 0.06,37 3,38 37,39 46.694,40 52.567,41 31.534,42 29.74,44 7.556}
{0 CHEMBL126929,1 7.301,2 43.8,3 45.8,4 1,5 1.12,6 0.666,7 0.634,8 350.45,9 4.2,10 16,11 48,13 17,14 29,16 51,17 21,20 15,21 6,22 1,24 22,25 5,28 2,29 3,32 26,35 6.3,36 0.059,37 3,38 38,39 48.022,40 53.777,41 31.989,42 30.455,44 8.205}
{0 CHEMBL1270235,1 9.518,2 42.6,3 46.8,4 0.99,5 1.119,6 0.718,7 0.646,8 447.35,9 6.4,10 16,11 47,13 16,14 28,16 50,17 20,20 13,21 7,24 22,25 5,26 1,27 1,28 3,29 1,32 25,34 1,35 2.1,36 0.08,37 4,38 36,39 46.538,40 52.577,41 33.745,42 30.364,43 2.1,44 8.138}
{0 CHEMBL1270332,1 9.712,2 38.9,3 46.3,4 0.999,5 1.123,6 0.715,7 0.645,8 524.47,9 7.4,10 16,11 54,13 18,14 32,16 57,17 21,20 13,21 8,22 2,24 25,25 8,26 2,27 1,28 4,29 2,31 1,32 29,34 1,35 3.7,36 0.105,37 6,38 42,39 53.927,40 60.62,41 38.614,42 34.814,43 1.9,44 8.24}
{0 CHEMBL1270333,1 9.985,2 42.2,3 44.4,4 1,5 1.119,6 0.721,7 0.657,8 449.32,9 6.7,10 16,11 45,13 16,14 28,16 48,17 19,20 13,21 6,24 20,25 6,26 1,27 1,28 3,29 2,32 25,34 1,35 4.4,36 0.083,37 4,38 36,39 44.982,40 50.371,41 32.438,42 29.552,43 2.2,44 7.488}
{0 CHEMBL127510,1 7.301,2 43.8,3 45.8,4 1,5 1.12,6 0.666,7 0.634,8 350.45,9 4.2,10 16,11 48,13 17,14 29,16 51,17 21,20 15,21 6,22 1,24 22,25 5,28 2,29 3,32 26,35 6.3,36 0.078,37 4,38 38,39 48.022,40 53.777,41 31.989,42 30.455,44 7.387}
{0 CHEMBL17350,1 6.683,2 40.8,3 51,4 0.994,5 1.125,6 0.643,7 0.602,8 327.46,9 2,10 12,11 49,13 12,14 26,16 51,17 20,20 12,21 8,24 25,25 4,28 1,29 3,32 24,35 6.1,36 0.078,37 4,38 32,39 48.687,40 55.109,41 31.506,42 29.487,44 7.621}
{0 CHEMBL17543,1 7.307,2 42.6,3 46.8,4 1.007,5 1.128,6 0.653,7 0.624,8 343.43,9 2.1,10 12,11 47,13 12,14 28,16 50,17 20,20 12,21 8,23 1,24 22,25 5,28 1,29 3,32 25,34 1,35 6.4,36 0.04,37 2,38 34,39 47.316,40 53.033,41 30.682,42 29.344,43 2.1,44 6.523}
{0 CHEMBL17703,1 7.488,2 41.7,3 45.8,4 1.013,5 1.13,6 0.649,7 0.626,8 359.43,9 2.1,10 12,11 48,13 12,14 29,16 51,17 20,20 12,21 8,23 1,24 22,25 6,28 1,29 4,32 26,34 1,35 8.3,36 0.039,37 2,38 35,39 48.643,40 54.243,41 31.137,42 30.059,43 2.1,44 6.686}
{0 CHEMBL1778865,1 7.368,2 41,3 46.2,4 1.005,5 1.138,6 0.654,7 0.625,8 287.37,9 7.7,10 12,11 39,13 12,14 23,16 41,17 16,20 10,21 6,23 1,24 18,25 5,28 3,29 1,32 21,34 1,35 2.6,36 0.146,37 6,38 29,39 39.214,40 44.366,41 25.5,42 24.377,43 2.6,44 7.569}
{0 CHEMBL1778866,1 7.368,2 41,3 46.2,4 1.005,5 1.138,6 0.654,7 0.625,8 287.37,9 7.7,10 12,11 39,13 12,14 23,16 41,17 16,20 10,21 6,23 1,24 18,25 5,28 3,29 1,32 21,34 1,35 2.6,36 0.122,37 5,38 29,39 39.214,40 44.366,41 25.5,42 24.377,43 2.6,44 7.276}
{0 CHEMBL1778867,1 7.176,2 40.5,3 47.6,4 1.002,5 1.138,6 0.649,7 0.617,8 301.4,9 7.1,10 12,11 42,13 12,14 24,16 44,17 17,20 10,21 7,23 1,24 20,25 5,28 3,29 1,32 22,34 1,35 2.4,36 0.114,37 5,38 30,39 42.098,40 47.781,41 27.262,42 25.904,43 2.4,44 7.268}
{0 CHEMBL1778868,1 7.471,2 38.5,3 46.2,4 1.014,5 1.143,6 0.64,7 0.618,8 291.36,9 7.7,10 12,11 39,13 12,14 22,16 40,17 15,20 10,21 5,23 1,24 18,25 6,28 3,29 2,32 21,34 1,35 5.1,36 0.175,37 7,38 28,39 39.542,40 44.575,41 24.955,42 24.092,43 2.6,44 6.67}
{0 CHEMBL1778869,1 7.058,2 39,3 48.8,4 1.002,5 1.141,6 0.641,7 0.607,8 289.39,9 7.3,10 12,11 41,13 12,14 22,16 42,17 16,20 10,21 6,23 1,24 20,25 5,28 3,29 1,32 21,34 1,35 2.4,36 0.143,37 6,38 28,39 41.098,40 46.781,41 26.262,42 24.904,43 2.4,44 6.664}
{0 CHEMBL1778870,1 7.467,2 40,3 45.7,4 1.009,5 1.141,6 0.65,7 0.624,8 261.33,9 8.6,10 12,11 35,13 12,14 20,16 36,17 14,20 10,21 4,23 1,24 16,25 5,28 3,29 1,32 19,34 1,35 2.9,36 0.139,37 5,38 26,39 35.331,40 39.95,41 22.739,42 21.85,43 2.9,44 6.593}
{0 CHEMBL1778991,1 7.593,2 41.7,3 44.4,4 1.009,5 1.138,6 0.659,7 0.635,8 273.34,9 8.3,10 12,11 36,13 12,14 22,16 38,17 15,20 10,21 5,23 1,24 16,25 5,28 3,29 1,32 20,34 1,35 2.8,36 0.132,37 5,38 28,39 36.331,40 40.95,41 23.739,42 22.85,43 2.8,44 6.368}
{0 CHEMBL1778992,1 7.381,2 39.5,3 46.5,4 1.01,5 1.139,6 0.645,7 0.619,8 317.4,9 7,10 12,11 43,13 12,14 25,16 45,17 17,20 10,21 7,23 1,24 20,25 6,28 3,29 2,32 23,34 1,35 4.7,36 0.133,37 6,38 31,39 43.425,40 48.99,41 27.716,42 26.618,43 2.3,44 6.215}
{0 CHEMBL1778993,1 7.912,2 43.9,3 41.5,4 1.011,5 1.133,6 0.677,7 0.655,8 324.39,9 9.8,10 18,11 41,13 18,14 26,16 43,17 18,20 15,21 3,23 1,24 17,25 6,28 4,29 1,32 24,34 1,35 2.4,36 0.14,37 6,38 35,39 41.432,40 46.449,41 27.745,42 26.871,43 2.4,44 5.448}
{0 CHEMBL1778994,1 7.867,2 42.9,3 42.9,4 1.015,5 1.145,6 0.663,7 0.643,8 275.33,9 8.6,10 12,11 35,13 12,14 22,16 37,17 15,20 10,21 5,23 2,24 15,25 5,28 3,32 20,34 2,36 0.108,37 4,38 28,39 35.516,40 40.081,41 23.222,42 22.518,43 5.7,44 6.73}
{0 CHEMBL1778995,1 7.867,2 42.9,3 42.9,4 1.015,5 1.145,6 0.663,7 0.643,8 275.33,9 8.6,10 12,11 35,13 12,14 22,16 37,17 15,20 10,21 5,23 2,24 15,25 5,28 3,32 20,34 2,36 0.135,37 5,38 28,39 35.516,40 40.081,41 23.222,42 22.518,43 5.7,44 6.467}
{0 CHEMBL1778996,1 8.166,2 43.8,3 40.6,4 1.02,5 1.146,6 0.671,7 0.656,8 261.3,9 9.4,10 12,11 32,13 12,14 21,16 34,17 14,20 10,21 4,23 2,24 13,25 5,28 3,32 19,34 2,36 0.118,37 4,38 27,39 32.632,40 36.666,41 21.461,42 20.992,43 6.3,44 5.526}
{0 CHEMBL1778997,1 7.368,2 41,3 46.2,4 1.005,5 1.138,6 0.654,7 0.625,8 287.37,9 7.7,10 12,11 39,13 12,14 23,16 41,17 16,20 10,21 6,23 1,24 18,25 5,28 3,29 1,32 21,34 1,35 2.6,36 0.146,37 6,38 29,39 39.214,40 44.366,41 25.5,42 24.377,43 2.6,44 6.22}
{0 CHEMBL1778998,1 7.593,2 41.7,3 44.4,4 1.009,5 1.138,6 0.659,7 0.635,8 273.34,9 8.3,10 12,11 36,13 12,14 22,16 38,17 15,20 10,21 5,23 1,24 16,25 5,28 3,29 1,32 20,34 1,35 2.8,36 0.132,37 5,38 28,39 36.331,40 40.95,41 23.739,42 22.85,43 2.8,44 5.244}
{0 CHEMBL1778999,1 7.138,2 43.6,3 46.2,4 0.99,5 1.126,6 0.676,7 0.635,8 278.39,9 10.3,10 12,11 39,13 13,14 23,16 41,17 17,19 1,20 10,21 6,24 18,25 4,28 4,32 21,33 1,36 0.098,37 4,38 31,39 38.592,40 43.9,41 26.353,42 24.773,44 5.809}
{0 CHEMBL1779000,1 7.138,2 43.6,3 46.2,4 0.99,5 1.126,6 0.676,7 0.635,8 278.39,9 10.3,10 12,11 39,13 13,14 23,16 41,17 17,19 1,20 10,21 6,24 18,25 4,28 4,32 21,33 1,36 0.098,37 4,38 31,39 38.592,40 43.9,41 26.353,42 24.773,44 5.804}
{0 CHEMBL1779001,1 6.814,2 39.1,3 50,4 0.996,5 1.132,6 0.642,7 0.604,8 313.44,9 6.5,10 12,11 46,13 12,14 25,16 48,17 18,20 10,21 8,24 23,25 5,28 3,29 2,32 23,35 4.3,36 0.125,37 6,38 31,39 45.796,40 52.066,41 29.54,42 27.762,44 5.772}
{0 CHEMBL1779002,1 6.899,2 40,3 48.9,4 0.993,5 1.132,6 0.652,7 0.612,8 310.44,9 8.9,10 12,11 45,13 13,14 25,16 47,17 18,20 11,21 7,22 1,24 22,25 5,28 4,29 1,32 23,35 2.2,36 0.106,37 5,38 32,39 44.687,40 50.939,41 29.33,42 27.542,44 5}
{0 CHEMBL1779003,1 6.986,2 41.9,3 48.8,4 0.997,5 1.133,6 0.652,7 0.614,8 300.41,9 4.7,10 12,11 43,13 12,14 24,16 45,17 18,20 11,21 7,23 1,24 21,25 4,28 2,29 1,32 22,34 1,35 2.3,36 0.111,37 5,38 30,39 42.88,40 48.698,41 28.017,42 26.409,43 2.3,44 7.921}
{0 CHEMBL1779004,1 6.805,2 43.2,3 50,4 0.992,5 1.128,6 0.654,7 0.612,8 299.42,9 2.3,10 12,11 44,13 12,14 24,16 46,17 19,20 12,21 7,23 1,24 22,25 3,28 1,29 1,32 22,34 1,35 2.3,36 0.109,37 5,38 30,39 43.661,40 49.615,41 28.773,42 26.914,43 2.3,44 7.319}
{0 CHEMBL1779005,1 6.986,2 41.9,3 48.8,4 0.997,5 1.133,6 0.652,7 0.614,8 300.41,9 4.7,10 12,11 43,13 12,14 24,16 45,17 18,20 11,21 7,23 1,24 21,25 4,28 2,29 1,32 22,34 1,35 2.3,36 0.111,37 5,38 30,39 42.88,40 48.698,41 28.017,42 26.409,43 2.3,44 7.18}
{0 CHEMBL1779006,1 6.986,2 41.9,3 48.8,4 0.997,5 1.133,6 0.652,7 0.614,8 300.41,9 4.7,10 12,11 43,13 12,14 24,16 45,17 18,20 11,21 7,23 1,24 21,25 4,28 2,29 1,32 22,34 1,35 2.3,36 0.111,37 5,38 30,39 42.88,40 48.698,41 28.017,42 26.409,43 2.3,44 5.051}
{0 CHEMBL1779007,1 6.836,2 41.3,3 50,4 0.995,5 1.133,6 0.647,7 0.607,8 314.44,9 4.3,10 12,11 46,13 12,14 25,16 48,17 19,20 11,21 8,23 1,24 23,25 4,28 2,29 1,32 23,34 1,35 2.2,36 0.104,37 5,38 31,39 45.763,40 52.113,41 29.779,42 27.936,43 2.2,44 6.951}
{0 CHEMBL1779008,1 7.035,2 41,3 48.7,4 1,5 1.135,6 0.648,7 0.612,8 274.37,9 5.1,10 12,11 39,13 12,14 21,16 40,17 16,20 11,21 5,23 1,24 19,25 4,28 2,29 1,32 20,34 1,35 2.6,36 0.125,37 5,38 27,39 38.996,40 44.283,41 25.256,42 23.882,43 2.6,44 6.575}
{0 CHEMBL1779009,1 7.361,2 43.2,3 45.9,4 1.003,5 1.132,6 0.662,7 0.631,8 272.35,9 5.4,10 12,11 37,13 12,14 22,16 39,17 16,20 11,21 5,23 1,24 17,25 4,28 2,29 1,32 20,34 1,35 2.7,36 0.077,37 3,38 28,39 37.112,40 41.867,41 24.495,42 23.355,43 2.7,44 6.357}
{0 CHEMBL1779010,1 7.709,2 47.5,3 42.5,4 1.003,5 1.122,6 0.687,7 0.659,8 308.38,9 5,10 18,11 40,13 18,14 25,16 42,17 19,20 17,21 2,23 1,24 17,25 4,28 2,29 1,32 23,34 1,35 2.5,36 0.119,37 5,38 34,39 40.112,40 44.867,41 27.495,42 26.355,43 2.5,44 6.34}
{0 CHEMBL1779011,1 7.375,2 41.5,3 46.3,4 1.008,5 1.134,6 0.651,7 0.624,8 302.38,9 4.9,10 12,11 41,13 12,14 24,16 43,17 17,20 11,21 6,23 1,24 19,25 5,28 2,29 2,32 22,34 1,35 4.9,36 0.093,37 4,38 30,39 41.323,40 46.492,41 26.711,42 25.597,43 2.4,44 6.152}
{0 CHEMBL1779012,1 8.459,2 45,3 37.5,4 1.022,5 1.131,6 0.686,7 0.676,8 338.37,9 10,10 18,11 40,13 19,14 27,16 42,17 18,20 16,21 2,22 1,23 1,24 15,25 7,28 4,29 2,32 25,34 1,35 5,36 0.119,37 5,38 37,39 40.876,40 45.243,41 27.438,42 27.059,43 2.5,44 7.097}
{0 CHEMBL1779013,1 8.229,2 46.3,3 39,4 1.016,5 1.126,6 0.688,7 0.672,8 337.38,9 7.3,10 18,11 41,13 19,14 27,16 43,17 19,20 17,21 2,22 1,23 1,24 16,25 6,28 3,29 2,32 25,34 1,35 4.9,36 0.116,37 5,38 37,39 41.658,40 46.16,41 28.193,42 27.565,43 2.4,44 6.936}
{0 CHEMBL1779014,1 8.009,2 47.6,3 40.5,4 1.01,5 1.121,6 0.689,7 0.668,8 336.39,9 4.8,10 18,11 42,13 19,14 27,16 44,17 20,20 18,21 2,22 1,23 1,24 17,25 5,28 2,29 2,32 25,34 1,35 4.8,36 0.114,37 5,38 37,39 42.44,40 47.077,41 28.949,42 28.07,43 2.4,44 6.347}
{0 CHEMBL1779015,1 7.487,2 40.9,3 45.5,4 1.01,5 1.136,6 0.653,7 0.628,8 329.41,9 6.8,10 12,11 44,13 13,14 26,16 46,17 18,20 12,21 6,22 1,23 1,24 20,25 6,28 3,29 2,32 24,34 1,35 4.5,36 0.087,37 4,38 33,39 44.425,40 49.99,41 28.716,42 27.618,43 2.3,44 6.572}
{0 CHEMBL1779016,1 7.485,2 42.9,3 45.2,4 1.008,5 1.131,6 0.66,7 0.633,8 314.39,9 4.8,10 12,11 42,13 13,14 25,16 44,17 18,20 12,21 6,22 1,23 1,24 19,25 5,28 2,29 2,32 23,34 1,35 4.8,36 0.114,37 5,38 32,39 42.323,40 47.492,41 27.711,42 26.597,43 2.4,44 6.469}
{0 CHEMBL1779017,1 7.584,2 40,3 45,4 1.014,5 1.139,6 0.649,7 0.627,8 303.37,9 7.5,10 12,11 40,13 13,14 23,16 41,17 16,20 12,21 4,22 1,23 1,24 18,25 6,28 3,29 2,32 22,34 1,35 5,36 0.098,37 4,38 30,39 40.542,40 45.575,41 25.955,42 25.092,43 2.5,44 6.377}
{0 CHEMBL1779018,1 7.375,2 41.5,3 46.3,4 1.008,5 1.134,6 0.651,7 0.624,8 302.38,9 4.9,10 12,11 41,13 13,14 23,16 42,17 17,20 12,21 5,22 1,23 1,24 19,25 5,28 2,29 2,32 22,34 1,35 4.9,36 0.143,37 6,38 30,39 41.323,40 46.492,41 26.711,42 25.597,43 2.4,44 6.33}
{0 CHEMBL1779019,1 7.702,2 43.6,3 43.6,4 1.011,5 1.13,6 0.665,7 0.643,8 300.36,9 5.1,10 12,11 39,13 13,14 24,16 41,17 17,20 12,21 5,22 1,23 1,24 17,25 5,28 2,29 2,32 22,34 1,35 5.1,36 0.122,37 5,38 31,39 39.44,40 44.077,41 25.949,42 25.07,43 2.6,44 6.225}
{0 CHEMBL1779020,1 8.106,2 41.5,3 41.5,4 1.027,5 1.134,6 0.655,7 0.646,8 332.36,9 4.9,10 12,11 41,13 14,14 25,16 42,17 17,20 13,21 4,22 2,23 1,24 17,25 7,28 2,29 4,32 24,34 1,35 9.8,36 0.167,37 7,38 33,39 42.094,40 46.496,41 26.858,42 26.5,43 2.4,44 6.109}
{0 CHEMBL1940477,1 6.84,2 43.4,3 49.1,4 0.99,5 1.121,6 0.661,7 0.619,8 362.51,9 3.8,10 16,11 53,13 17,14 30,16 56,17 23,20 15,21 8,22 1,24 26,25 4,28 2,29 2,32 27,35 3.8,36 0.107,37 6,38 39,39 52.461,40 59.398,41 35.057,42 32.794,44 6.489}
{0 CHEMBL1940478,1 6.97,2 44,3 48,4 0.992,5 1.12,6 0.666,7 0.625,8 348.48,9 4,10 16,11 50,13 17,14 29,16 53,17 22,20 15,21 7,22 1,24 24,25 4,28 2,29 2,32 26,35 4,36 0.094,37 5,38 38,39 49.578,40 55.983,41 33.296,42 31.267,44 5.178}
{0 CHEMBL1940479,1 6.84,2 43.4,3 49.1,4 0.99,5 1.121,6 0.661,7 0.619,8 362.51,9 3.8,10 16,11 53,13 17,14 30,16 56,17 23,20 15,21 8,22 1,24 26,25 4,28 2,29 2,32 27,35 3.8,36 0.107,37 6,38 39,39 52.461,40 59.398,41 35.057,42 32.794,44 5.536}
{0 CHEMBL1940480,1 6.97,2 44,3 48,4 0.992,5 1.12,6 0.666,7 0.625,8 348.48,9 4,10 16,11 50,13 17,14 29,16 53,17 22,20 15,21 7,22 1,24 24,25 4,28 2,29 2,32 26,35 4,36 0.094,37 5,38 38,39 49.578,40 55.983,41 33.296,42 31.267,44 5.146}
{0 CHEMBL1940482,1 6.97,2 44,3 48,4 0.992,5 1.12,6 0.666,7 0.625,8 348.48,9 4,10 16,11 50,13 17,14 29,16 53,17 22,20 15,21 7,22 1,24 24,25 4,28 2,29 2,32 26,35 4,36 0.094,37 5,38 38,39 49.578,40 55.983,41 33.296,42 31.267,44 7.77}
{0 CHEMBL1940597,1 7.397,2 44.9,3 44.9,4 1,5 1.118,6 0.673,7 0.642,8 362.46,9 4.1,10 16,11 49,13 18,14 30,16 52,17 22,20 16,21 6,22 2,24 22,25 5,28 2,29 3,32 27,35 6.1,36 0.077,37 4,38 40,39 49.022,40 54.777,41 32.989,42 31.455,44 5.701}
{0 CHEMBL1940599,1 7.397,2 44.9,3 44.9,4 1,5 1.118,6 0.673,7 0.642,8 362.46,9 4.1,10 16,11 49,13 18,14 30,16 52,17 22,20 16,21 6,22 2,24 22,25 5,28 2,29 3,32 27,35 6.1,36 0.077,37 4,38 40,39 49.022,40 54.777,41 32.989,42 31.455,44 7.658}
{0 CHEMBL2036513,1 7.316,2 38.8,3 46.9,4 1.008,5 1.141,6 0.643,7 0.616,8 358.46,9 8.2,10 12,11 49,13 13,14 28,16 51,17 19,20 11,21 8,22 1,23 1,24 23,25 7,28 4,29 2,32 26,34 1,35 4.1,36 0.118,37 6,38 35,39 49.411,40 55.904,41 31.483,42 30.167,43 2,44 8.037}
{0 CHEMBL2036514,1 7.316,2 38.8,3 46.9,4 1.008,5 1.141,6 0.643,7 0.616,8 358.46,9 8.2,10 12,11 49,13 13,14 28,16 51,17 19,20 11,21 8,22 1,23 1,24 23,25 7,28 4,29 2,32 26,34 1,35 4.1,36 0.118,37 6,38 35,39 49.411,40 55.904,41 31.483,42 30.167,43 2,44 8.292}
{0 CHEMBL212484,1 8.451,2 43.2,3 40.9,4 1.015,5 1.122,6 0.689,7 0.665,8 371.85,9 6.8,10 16,11 44,13 17,14 29,16 47,17 19,18 1,20 14,21 5,22 1,24 18,25 7,26 1,28 3,29 3,32 26,34 1,35 6.8,36 0.064,37 3,38 38,39 44.68,40 49.389,41 30.33,42 29.251,43 2.3,44 7.854}
{0 CHEMBL212990,1 7.477,2 42.6,3 44.7,4 1.005,5 1.125,6 0.665,7 0.637,8 351.44,9 6.4,10 16,11 47,13 17,14 29,16 50,17 20,20 14,21 6,22 1,24 21,25 6,28 3,29 3,32 26,35 6.4,36 0.06,37 3,38 38,39 47.24,40 52.86,41 31.233,42 29.95,44 8.523}
{0 CHEMBL213172,1 7.309,2 42,3 46,4 1.002,5 1.126,6 0.66,7 0.63,8 365.47,9 6,10 16,11 50,13 17,14 30,16 53,17 21,20 14,21 7,22 1,24 23,25 6,28 3,29 3,32 27,35 6,36 0.075,37 4,38 39,39 50.123,40 56.275,41 32.995,42 31.477,44 8.495}
{0 CHEMBL213256,1 7.292,2 43.5,3 45.7,4 0.998,5 1.123,6 0.669,7 0.636,8 335.44,9 6.5,10 16,11 46,13 17,14 28,16 49,17 20,20 14,21 6,22 1,24 21,25 5,28 3,29 2,32 25,35 4.3,36 0.061,37 3,38 37,39 45.912,40 51.651,41 30.779,42 29.235,44 8}
{0 CHEMBL214632,1 7.132,2 42.9,3 46.9,4 0.996,5 1.124,6 0.664,7 0.628,8 349.47,9 6.1,10 16,11 49,13 17,14 29,16 52,17 21,20 14,21 7,22 1,24 23,25 5,28 3,29 2,32 26,35 4.1,36 0.058,37 3,38 38,39 48.796,40 55.066,41 32.54,42 30.762,44 8.076}
{0 CHEMBL214758,1 7.683,2 43.5,3 43.5,4 1.009,5 1.13,6 0.668,7 0.644,8 353.43,9 6.5,10 16,11 46,13 17,14 29,16 49,17 20,20 14,21 6,22 1,23 1,24 20,25 6,28 3,29 2,32 26,34 1,35 4.3,36 0.061,37 3,38 38,39 46.425,40 51.99,41 30.716,42 29.618,43 2.2,44 8.398}
{0 CHEMBL215371,1 7.116,2 42.6,3 46.8,4 0.993,5 1.126,6 0.667,7 0.629,8 334.46,9 8.5,10 16,11 47,13 17,14 28,16 50,17 20,20 14,21 6,22 1,24 22,25 5,28 4,29 1,32 25,35 2.1,36 0.06,37 3,38 37,39 46.687,40 52.939,41 31.33,42 29.542,44 6.845}
{0 CHEMBL215372,1 7.784,2 39.6,3 45.3,4 1.006,5 1.126,6 0.673,7 0.636,8 412.56,9 7.5,10 16,11 53,13 19,14 32,16 56,17 21,20 14,21 7,22 3,24 24,25 8,26 1,28 4,29 3,31 1,32 29,35 5.7,36 0.089,37 5,38 43,39 53.302,40 59.693,41 35.648,42 33.685,44 8.523}
{0 CHEMBL2178776,1 6.224,2 38.1,3 54.8,4 0.988,5 1.131,6 0.626,7 0.577,8 522.8,9 2.4,10 6,11 84,13 7,14 44,16 90,17 32,20 8,21 24,22 1,24 46,25 6,28 2,29 4,32 38,35 4.8,36 0.089,37 8,38 48,39 82.952,40 94.969,41 52.58,42 48.492,44 4}
{0 CHEMBL2178777,1 6.415,2 38.1,3 54.8,4 0.985,5 1.127,6 0.64,7 0.583,8 538.87,9 2.4,10 6,11 84,13 7,14 44,16 90,17 32,20 8,21 24,22 1,24 46,25 6,26 1,28 2,29 3,31 1,32 38,35 3.6,36 0.089,37 8,38 48,39 82.701,40 94.679,41 53.773,42 48.964,44 4}
{0 CHEMBL2178778,1 6.043,2 37.4,3 56,4 0.983,5 1.133,6 0.623,7 0.57,8 549.88,9 3.3,10 6,11 91,13 7,14 46,16 97,17 34,20 8,21 26,22 1,24 51,25 6,28 3,29 3,32 40,35 3.3,36 0.103,37 10,38 50,39 89.494,40 103.088,41 56.654,42 51.852,44 5.479}
{0 CHEMBL2178779,1 6.351,2 39,3 53.7,4 0.989,5 1.129,6 0.632,7 0.585,8 520.78,9 2.4,10 6,11 82,13 8,14 44,16 88,17 32,20 9,21 23,22 2,24 44,25 6,28 2,29 4,32 38,35 4.9,36 0.068,37 6,38 49,39 81.068,40 92.553,41 51.819,42 47.965,44 4}
{0 CHEMBL2178780,1 6.292,2 38.8,3 54.1,4 0.988,5 1.129,6 0.63,7 0.582,8 534.81,9 2.4,10 6,11 85,13 8,14 45,16 91,17 33,20 9,21 24,22 2,24 46,25 6,28 2,29 4,32 39,35 4.7,36 0.077,37 7,38 50,39 83.952,40 95.969,41 53.58,42 49.492,44 4}
{0 CHEMBL2178781,1 6.237,2 38.6,3 54.5,4 0.987,5 1.129,6 0.629,7 0.58,8 548.84,9 2.3,10 6,11 88,13 8,14 46,16 94,17 34,20 9,21 25,22 2,24 48,25 6,28 2,29 4,32 40,35 4.5,36 0.085,37 8,38 51,39 86.836,40 99.384,41 55.342,42 51.018,44 5.011}
{0 CHEMBL2178782,1 6.106,2 38.6,3 55.4,4 0.983,5 1.13,6 0.628,7 0.576,8 506.8,9 2.4,10 6,11 83,13 7,14 43,16 89,17 32,20 8,21 24,22 1,24 46,25 5,28 2,29 3,32 37,35 3.6,36 0.079,37 7,38 47,39 81.625,40 93.759,41 52.126,42 47.777,44 4}
{0 CHEMBL2178783,1 6.056,2 38.4,3 55.8,4 0.983,5 1.13,6 0.627,7 0.573,8 520.83,9 2.3,10 6,11 86,13 7,14 44,16 92,17 33,20 8,21 25,22 1,24 48,25 5,28 2,29 3,32 38,35 3.5,36 0.087,37 8,38 48,39 84.508,40 97.174,41 53.887,42 49.304,44 4.388}
{0 CHEMBL2178784,1 6.01,2 38.2,3 56.2,4 0.982,5 1.13,6 0.625,7 0.571,8 534.86,9 2.2,10 6,11 89,13 7,14 45,16 95,17 34,20 8,21 26,22 1,24 50,25 5,28 2,29 3,32 39,35 3.4,36 0.095,37 9,38 49,39 87.392,40 100.59,41 55.648,42 50.83,44 5.337}
{0 CHEMBL2178785,1 5.966,2 38,3 56.5,4 0.981,5 1.13,6 0.624,7 0.569,8 548.89,9 2.2,10 6,11 92,13 7,14 46,16 98,17 35,20 8,21 27,22 1,24 52,25 5,28 2,29 3,32 40,35 3.3,36 0.102,37 10,38 50,39 90.276,40 104.005,41 57.41,42 52.357,44 4.961}
{0 CHEMBL2178786,1 5.925,2 37.9,3 56.8,4 0.981,5 1.131,6 0.623,7 0.567,8 562.92,9 2.1,10 6,11 95,13 7,14 47,16 101,17 36,20 8,21 28,22 1,24 54,25 5,28 2,29 3,32 41,35 3.2,36 0.109,37 11,38 51,39 93.159,40 107.42,41 59.171,42 53.884,44 5.538}
{0 CHEMBL2178787,1 5.887,2 37.8,3 57.1,4 0.98,5 1.131,6 0.622,7 0.565,8 576.95,9 2,10 6,11 98,13 7,14 48,16 104,17 37,20 8,21 29,22 1,24 56,25 5,28 2,29 3,32 42,35 3.1,36 0.115,37 12,38 52,39 96.043,40 110.835,41 60.933,42 55.411,44 4}
{0 CHEMBL2178788,1 5.966,2 38,3 56.5,4 0.981,5 1.13,6 0.624,7 0.569,8 548.89,9 2.2,10 6,11 92,13 7,14 46,16 98,17 35,20 8,21 27,22 1,24 52,25 5,28 2,29 3,32 40,35 3.3,36 0.092,37 9,38 50,39 90.276,40 104.005,41 57.41,42 52.357,44 5.28}
{0 CHEMBL2178789,1 5.925,2 37.9,3 56.8,4 0.981,5 1.131,6 0.623,7 0.567,8 562.92,9 2.1,10 6,11 95,13 7,14 47,16 101,17 36,20 8,21 28,22 1,24 54,25 5,28 2,29 3,32 41,35 3.2,36 0.099,37 10,38 51,39 93.159,40 107.42,41 59.171,42 53.884,44 4}
{0 CHEMBL2178790,1 5.887,2 37.8,3 57.1,4 0.98,5 1.131,6 0.622,7 0.565,8 576.95,9 2,10 6,11 98,13 7,14 48,16 104,17 37,20 8,21 29,22 1,24 56,25 5,28 2,29 3,32 42,35 3.1,36 0.106,37 11,38 52,39 96.043,40 110.835,41 60.933,42 55.411,44 4}
{0 CHEMBL2178791,1 6.229,2 37.4,3 54.9,4 0.99,5 1.132,6 0.622,7 0.574,8 566.86,9 2.2,10 6,11 91,13 7,14 47,16 97,17 34,20 8,21 26,22 1,24 50,25 7,28 2,29 5,32 41,35 5.5,36 0.113,37 11,38 51,39 90.047,40 103.008,41 56.557,42 52.26,44 4}
{0 CHEMBL2180986,1 6.814,2 43.1,3 49,4 0.987,5 1.123,6 0.664,7 0.619,8 347.5,9 5.9,10 16,11 51,13 17,14 29,16 54,17 22,20 15,21 7,22 1,24 25,25 4,28 3,29 1,32 26,35 2,36 0.093,37 5,38 38,39 50.352,40 57.272,41 33.847,42 31.574,44 5.928}
{0 CHEMBL2180987,1 6.814,2 43.1,3 49,4 0.987,5 1.123,6 0.664,7 0.619,8 347.5,9 5.9,10 16,11 51,13 17,14 29,16 54,17 22,20 15,21 7,22 1,24 25,25 4,28 3,29 1,32 26,35 2,36 0.093,37 5,38 38,39 50.352,40 57.272,41 33.847,42 31.574,44 5.644}
{0 CHEMBL2180988,1 7.467,2 40.4,3 47.4,4 0.999,5 1.123,6 0.67,7 0.627,8 425.6,9 5.3,10 16,11 57,13 19,14 33,16 60,17 23,20 15,21 8,22 3,24 27,25 7,26 1,28 3,29 3,31 1,32 30,35 5.3,36 0.117,37 7,38 44,39 56.967,40 64.026,41 38.165,42 35.717,44 6.495}
{0 CHEMBL2180989,1 7.467,2 40.4,3 47.4,4 0.999,5 1.123,6 0.67,7 0.627,8 425.6,9 5.3,10 16,11 57,13 19,14 33,16 60,17 23,20 15,21 8,22 3,24 27,25 7,26 1,28 3,29 3,31 1,32 30,35 5.3,36 0.117,37 7,38 44,39 56.967,40 64.026,41 38.165,42 35.717,44 8.051}
{0 CHEMBL2181206,1 7.85,2 41.1,3 44.6,4 1.007,5 1.122,6 0.676,7 0.641,8 439.58,9 5.4,10 16,11 56,13 20,14 34,16 59,17 23,20 16,21 7,22 4,24 25,25 8,26 1,28 3,29 4,31 1,32 31,35 7.1,36 0.102,37 6,38 46,39 56.411,40 62.82,41 37.858,42 35.905,44 7.201}
{0 CHEMBL219631,1 7.893,2 41.2,3 45.1,4 1.01,5 1.127,6 0.673,7 0.638,8 402.53,9 3.9,10 12,11 51,13 14,14 31,16 54,17 21,20 13,21 8,22 2,23 1,24 23,25 7,26 1,28 2,29 3,31 1,32 28,34 1,35 5.9,36 0.111,37 6,38 39,39 51.494,40 57.452,41 34.336,42 32.552,43 2,44 8.289}
{0 CHEMBL219634,1 7.292,2 43.5,3 45.7,4 0.998,5 1.123,6 0.669,7 0.636,8 335.44,9 6.5,10 16,11 46,13 17,14 28,16 49,17 20,20 14,21 6,22 1,24 21,25 5,28 3,29 2,32 25,35 4.3,36 0.061,37 3,38 37,39 45.912,40 51.651,41 30.779,42 29.235,44 8.398}
{0 CHEMBL219737,1 7.132,2 42.9,3 46.9,4 0.996,5 1.124,6 0.664,7 0.628,8 349.47,9 6.1,10 16,11 49,13 17,14 29,16 52,17 21,20 14,21 7,22 1,24 23,25 5,28 3,29 2,32 26,35 4.1,36 0.058,37 3,38 38,39 48.796,40 55.066,41 32.54,42 30.762,44 8.357}
{0 CHEMBL219742,1 7.147,2 43.1,3 47.1,4 0.998,5 1.121,6 0.662,7 0.627,8 364.48,9 3.9,10 16,11 51,13 17,14 30,16 54,17 22,20 15,21 7,22 1,24 24,25 5,28 2,29 3,32 27,35 5.9,36 0.074,37 4,38 39,39 50.905,40 57.192,41 33.75,42 31.982,44 5.097}
{0 CHEMBL219985,1 7.843,2 43.8,3 41.7,4 1.01,5 1.124,6 0.677,7 0.655,8 376.45,9 8.3,10 16,11 48,13 18,14 32,16 52,17 21,20 15,21 6,22 2,24 20,25 7,28 4,29 3,32 28,35 6.3,36 0.058,37 3,38 42,39 48.458,40 53.943,41 32.478,42 31.444,44 6.714}
{0 CHEMBL219986,1 7.655,2 41.7,3 43.8,4 1.012,5 1.126,6 0.66,7 0.639,8 367.44,9 6.3,10 16,11 48,13 17,14 30,16 51,17 20,20 14,21 6,22 1,24 21,25 7,28 3,29 4,32 27,35 8.3,36 0.059,37 3,38 39,39 48.567,40 54.069,41 31.688,42 30.665,44 8.741}
{0 CHEMBL219987,1 7.316,2 44.9,3 44.9,4 0.994,5 1.121,6 0.68,7 0.644,8 358.48,9 8.2,10 20,11 49,13 21,14 31,16 53,17 22,20 16,21 6,22 1,24 22,25 5,28 4,29 1,32 27,35 2,36 0.057,37 3,38 42,39 48.687,40 54.939,41 33.33,42 31.542,44 7.699}
{0 CHEMBL220041,1 6.947,2 43.8,3 47.9,4 0.989,5 1.122,6 0.668,7 0.626,8 333.47,9 6.3,10 16,11 48,13 17,14 28,16 51,17 21,20 15,21 6,22 1,24 23,25 4,28 3,29 1,32 25,35 2.1,36 0.078,37 4,38 37,39 47.469,40 53.856,41 32.086,42 30.047,44 8.036}
{0 CHEMBL220266,1 7.132,2 42.9,3 46.9,4 0.996,5 1.124,6 0.664,7 0.628,8 349.47,9 6.1,10 16,11 49,13 17,14 29,16 52,17 21,20 14,21 7,22 1,24 23,25 5,28 3,29 2,32 26,35 4.1,36 0.058,37 3,38 38,39 48.796,40 55.066,41 32.54,42 30.762,44 8.301}
{0 CHEMBL220319,1 7.683,2 43.5,3 43.5,4 1.009,5 1.13,6 0.668,7 0.644,8 353.43,9 6.5,10 16,11 46,13 17,14 29,16 49,17 20,20 14,21 6,22 1,23 1,24 20,25 6,28 3,29 2,32 26,34 1,35 4.3,36 0.061,37 3,38 38,39 46.425,40 51.99,41 30.716,42 29.618,43 2.2,44 8.284}
{0 CHEMBL220440,1 7.147,2 43.1,3 47.1,4 0.998,5 1.121,6 0.662,7 0.627,8 364.48,9 3.9,10 16,11 51,13 17,14 30,16 54,17 22,20 15,21 7,22 1,24 24,25 5,28 2,29 3,32 27,35 5.9,36 0.074,37 4,38 39,39 50.905,40 57.192,41 33.75,42 31.982,44 5.656}
{0 CHEMBL220441,1 7.622,2 40.7,3 46.3,4 1.002,5 1.122,6 0.674,7 0.633,8 411.57,9 5.6,10 16,11 54,13 19,14 32,16 57,17 22,20 15,21 7,22 3,24 25,25 7,26 1,28 3,29 3,31 1,32 29,35 5.6,36 0.088,37 5,38 43,39 54.083,40 60.61,41 36.404,42 34.191,44 6.796}
{0 CHEMBL220474,1 8.253,2 42.2,3 40,4 1.027,5 1.133,6 0.664,7 0.656,8 371.4,9 6.7,10 16,11 45,13 17,14 30,16 48,17 19,20 14,21 5,22 1,23 1,24 18,25 8,28 3,29 4,32 27,34 1,35 8.9,36 0.063,37 3,38 39,39 46.196,40 50.994,41 29.864,42 29.521,43 2.2,44 8.38}
{0 CHEMBL220611,1 7.86,2 42.6,3 42.6,4 1.016,5 1.132,6 0.663,7 0.645,8 369.43,9 6.4,10 16,11 47,13 17,14 30,16 50,17 20,20 14,21 6,22 1,23 1,24 20,25 7,28 3,29 3,32 27,34 1,35 6.4,36 0.06,37 3,38 39,39 47.752,40 53.2,41 31.171,42 30.333,43 2.1,44 8.66}
{0 CHEMBL220775,1 6.676,2 43.8,3 50,4 0.984,5 1.12,6 0.663,7 0.616,8 320.47,9 4.2,10 16,11 48,13 16,14 27,16 51,17 21,20 14,21 7,24 24,25 3,28 2,29 1,32 24,35 2.1,36 0.078,37 4,38 35,39 47.251,40 53.773,41 31.841,42 29.552,44 5.936}
{0 CHEMBL220786,1 7.719,2 41.7,3 45.8,4 1.002,5 1.119,6 0.68,7 0.638,8 370.51,9 4.2,10 16,11 48,13 18,14 29,16 51,17 20,20 14,21 6,22 2,24 22,25 6,26 1,28 2,29 3,31 1,32 26,35 6.3,36 0.078,37 4,38 39,39 48.098,40 53.697,41 32.637,42 30.642,44 5.097}
{0 CHEMBL220835,1 7.292,2 43.5,3 45.7,4 0.998,5 1.123,6 0.669,7 0.636,8 335.44,9 6.5,10 16,11 46,13 17,14 28,16 49,17 20,20 15,21 5,22 1,24 21,25 5,28 3,29 2,32 25,35 4.3,36 0.061,37 3,38 37,39 45.912,40 51.651,41 30.779,42 29.235,44 5.965}
{0 CHEMBL220841,1 7.292,2 45.7,3 45.7,4 0.998,5 1.115,6 0.674,7 0.64,8 335.43,9 2.2,10 16,11 46,13 17,14 28,16 49,17 21,20 15,21 6,22 1,24 21,25 4,28 1,29 3,32 25,35 6.5,36 0.061,37 3,38 37,39 45.92,40 51.279,41 30.983,42 29.434,44 5.08}
{0 CHEMBL221045,1 6.947,2 43.8,3 47.9,4 0.989,5 1.122,6 0.668,7 0.626,8 333.47,9 6.3,10 16,11 48,13 17,14 28,16 51,17 21,20 15,21 6,22 1,24 23,25 4,28 3,29 1,32 25,35 2.1,36 0.059,37 3,38 37,39 47.469,40 53.856,41 32.086,42 30.047,44 6.203}
{0 CHEMBL221107,1 7.575,2 45.7,3 43.5,4 1.003,5 1.117,6 0.679,7 0.651,8 348.43,9 4.3,10 16,11 46,13 18,14 29,16 49,17 21,20 16,21 5,22 2,24 20,25 5,28 2,29 3,32 26,35 6.5,36 0.061,37 3,38 39,39 46.138,40 51.362,41 31.228,42 29.928,44 6.128}
{0 CHEMBL221108,1 7.301,2 43.8,3 45.8,4 1,5 1.12,6 0.666,7 0.634,8 350.45,9 4.2,10 16,11 48,13 17,14 29,16 51,17 21,20 15,21 6,22 1,24 22,25 5,28 2,29 3,32 26,35 6.3,36 0.059,37 3,38 38,39 48.022,40 53.777,41 31.989,42 30.455,44 6.955}
{0 CHEMBL222197,1 7.622,2 40.7,3 46.3,4 1.002,5 1.122,6 0.674,7 0.633,8 411.57,9 5.6,10 16,11 54,13 19,14 32,16 57,17 22,20 15,21 7,22 3,24 25,25 7,26 1,28 3,29 3,31 1,32 29,35 5.6,36 0.088,37 5,38 43,39 54.083,40 60.61,41 36.404,42 34.191,44 7.523}
{0 CHEMBL222457,1 7.622,2 40.7,3 46.3,4 1.002,5 1.122,6 0.674,7 0.633,8 411.57,9 5.6,10 16,11 54,13 19,14 32,16 57,17 22,20 15,21 7,22 3,24 25,25 7,26 1,28 3,29 3,31 1,32 29,35 5.6,36 0.088,37 5,38 43,39 54.083,40 60.61,41 36.404,42 34.191,44 5.811}
{0 CHEMBL222458,1 7.147,2 43.1,3 47.1,4 0.998,5 1.121,6 0.662,7 0.627,8 364.48,9 3.9,10 16,11 51,13 17,14 30,16 54,17 22,20 15,21 7,22 1,24 24,25 5,28 2,29 3,32 27,35 5.9,36 0.074,37 4,38 39,39 50.905,40 57.192,41 33.75,42 31.982,44 6.604}
{0 CHEMBL222459,1 7.292,2 45.7,3 45.7,4 0.998,5 1.115,6 0.674,7 0.64,8 335.43,9 2.2,10 16,11 46,13 17,14 28,16 49,17 21,20 15,21 6,22 1,24 21,25 4,28 1,29 3,32 25,35 6.5,36 0.061,37 3,38 37,39 45.92,40 51.279,41 30.983,42 29.434,44 5.361}
{0 CHEMBL222615,1 7.309,2 42,3 46,4 1.002,5 1.126,6 0.66,7 0.63,8 365.47,9 6,10 16,11 50,13 17,14 30,16 53,17 21,20 14,21 7,22 1,24 23,25 6,28 3,29 3,32 27,35 6,36 0.057,37 3,38 39,39 50.123,40 56.275,41 32.995,42 31.477,44 8.461}
{0 CHEMBL222665,1 7.48,2 41.2,3 45.1,4 1.009,5 1.127,6 0.656,7 0.631,8 381.47,9 5.9,10 16,11 51,13 17,14 31,16 54,17 21,20 14,21 7,22 1,24 23,25 7,28 3,29 4,32 28,35 7.8,36 0.074,37 4,38 40,39 51.451,40 57.485,41 33.449,42 32.191,44 8.563}
{0 CHEMBL223248,1 7.477,2 42.6,3 44.7,4 1.005,5 1.125,6 0.665,7 0.637,8 351.44,9 6.4,10 16,11 47,13 17,14 29,16 50,17 20,20 14,21 6,22 1,24 21,25 6,28 3,29 3,32 26,35 6.4,36 0.06,37 3,38 38,39 47.24,40 52.86,41 31.233,42 29.95,44 8.528}
{0 CHEMBL223695,1 7.499,2 44.7,3 44.7,4 1.004,5 1.126,6 0.67,7 0.641,8 352.44,9 4.3,10 16,11 47,13 17,14 29,16 50,17 21,20 15,21 6,22 1,23 1,24 21,25 5,28 2,29 2,32 26,34 1,35 4.3,36 0.06,37 3,38 38,39 47.207,40 52.907,41 31.472,42 30.124,43 2.1,44 7.465}
{0 CHEMBL236893,1 6.601,2 42.9,3 51,4 0.987,5 1.12,6 0.654,7 0.608,8 323.47,9 2,10 12,11 49,13 13,14 26,16 51,17 21,20 13,21 8,22 1,24 25,25 3,28 1,29 2,32 24,35 4.1,36 0.098,37 5,38 33,39 48.36,40 54.9,41 32.052,42 29.773,44 7.523}
{0 CHEMBL236894,1 6.76,2 41.7,3 50,4 0.991,5 1.125,6 0.652,7 0.61,8 324.46,9 4.2,10 12,11 48,13 13,14 26,16 50,17 20,20 12,21 8,22 1,24 24,25 4,28 2,29 2,32 24,35 4.2,36 0.1,37 5,38 33,39 47.578,40 53.983,41 31.296,42 29.267,44 6}
{0 CHEMBL236895,1 6.76,2 41.7,3 50,4 0.991,5 1.125,6 0.652,7 0.61,8 324.46,9 4.2,10 12,11 48,13 13,14 26,16 50,17 20,20 12,21 8,22 1,24 24,25 4,28 2,29 2,32 24,35 4.2,36 0.1,37 5,38 33,39 47.578,40 53.983,41 31.296,42 29.267,44 6.068}
{0 CHEMBL237101,1 7.177,2 39.6,3 50,4 0.993,5 1.123,6 0.665,7 0.614,8 344.52,9 4.2,10 11,11 48,13 12,14 26,16 50,17 19,20 10,21 9,22 1,24 24,25 5,26 1,28 2,29 2,31 1,32 24,35 4.2,36 0.1,37 5,38 32.5,39 47.654,40 53.903,41 31.944,42 29.454,44 7.018}
{0 CHEMBL237102,1 6.74,2 42.3,3 50,4 0.99,5 1.123,6 0.655,7 0.611,8 350.5,9 3.8,10 12,11 52,13 13,14 29,16 55,17 22,20 13,21 9,22 1,24 26,25 4,28 2,29 2,32 26,35 3.8,36 0.055,37 3,38 36,39 51.461,40 58.398,41 34.057,42 31.794,44 6}
{0 CHEMBL237103,1 6.431,2 40.4,3 52.6,4 0.986,5 1.127,6 0.642,7 0.594,8 366.55,9 3.5,10 12,11 57,13 13,14 29,16 59,17 23,20 13,21 10,22 1,24 30,25 4,28 2,29 2,32 27,35 3.5,36 0.102,37 6,38 36,39 56.229,40 64.228,41 36.58,42 33.848,44 6}
{0 CHEMBL237320,1 6.789,2 42,3 50,4 0.994,5 1.122,6 0.65,7 0.61,8 339.47,9 2,10 12,11 50,13 13,14 27,16 52,17 21,20 13,21 8,22 1,24 25,25 4,28 1,29 3,32 25,35 6,36 0.096,37 5,38 34,39 49.687,40 56.109,41 32.506,42 30.487,44 7.721}
{0 CHEMBL237321,1 6.67,2 41.5,3 50.9,4 0.992,5 1.123,6 0.647,7 0.604,8 353.5,9 1.9,10 12,11 53,13 13,14 28,16 55,17 22,20 13,21 9,22 1,24 27,25 4,28 1,29 3,32 26,35 5.7,36 0.091,37 5,38 35,39 52.571,40 59.524,41 34.267,42 32.014,44 6.724}
{0 CHEMBL237322,1 6.49,2 42.3,3 51.9,4 0.985,5 1.121,6 0.65,7 0.602,8 337.5,9 1.9,10 12,11 52,13 13,14 27,16 54,17 22,20 13,21 9,22 1,24 27,25 3,28 1,29 2,32 25,35 3.8,36 0.093,37 5,38 34,39 51.243,40 58.315,41 33.813,42 31.299,44 5.301}
{0 CHEMBL237323,1 6.49,2 42.3,3 51.9,4 0.985,5 1.121,6 0.65,7 0.602,8 337.5,9 1.9,10 12,11 52,13 13,14 27,16 54,17 22,20 13,21 9,22 1,24 27,25 3,28 1,29 2,32 25,35 3.8,36 0.093,37 5,38 34,39 51.243,40 58.315,41 33.813,42 31.299,44 6.141}
{0 CHEMBL237533,1 7.149,2 42,3 48,4 1.004,5 1.129,6 0.649,7 0.617,8 357.46,9 2,10 12,11 50,13 13,14 28,16 52,17 21,20 13,21 8,22 1,23 1,24 24,25 5,28 1,29 3,32 26,34 1,35 6,36 0.096,37 5,38 35,39 50.2,40 56.449,41 32.444,42 30.871,43 2,44 7.886}
{0 CHEMBL237534,1 6.969,2 42.9,3 49,4 0.997,5 1.127,6 0.653,7 0.615,8 341.46,9 2,10 12,11 49,13 13,14 27,16 51,17 21,20 13,21 8,22 1,23 1,24 24,25 4,28 1,29 2,32 25,34 1,35 4.1,36 0.098,37 5,38 34,39 48.872,40 55.239,41 31.989,42 30.156,43 2,44 7.229}
{0 CHEMBL237751,1 6.948,2 40.8,3 49,4 0.998,5 1.126,6 0.648,7 0.612,8 340.46,9 4.1,10 12,11 49,13 13,14 27,16 51,17 20,20 12,21 8,22 1,24 24,25 5,28 2,29 3,32 25,35 6.1,36 0.098,37 5,38 34,39 48.905,40 55.192,41 31.75,42 29.982,44 8}
{0 CHEMBL237752,1 7.48,2 41.2,3 45.1,4 1.009,5 1.127,6 0.656,7 0.631,8 381.47,9 5.9,10 12,11 51,13 14,14 31,16 54,17 21,20 13,21 8,22 2,24 23,25 7,28 3,29 4,32 28,35 7.8,36 0.093,37 5,38 39,39 51.451,40 57.485,41 33.449,42 32.191,44 7.071}
{0 CHEMBL237962,1 6.817,2 40.4,3 50,4 0.996,5 1.127,6 0.644,7 0.606,8 354.49,9 3.8,10 12,11 52,13 13,14 28,16 54,17 21,20 12,21 9,22 1,24 26,25 5,28 2,29 3,32 26,35 5.8,36 0.093,37 5,38 35,39 51.789,40 58.607,41 33.512,42 31.509,44 6.936}
{0 CHEMBL237963,1 7.457,2 37.5,3 48.2,4 1.005,5 1.129,6 0.654,7 0.615,8 417.58,9 5.4,10 12,11 56,13 15,14 31,16 58,17 21,20 12,21 9,22 3,24 27,25 8,26 1,28 3,29 4,31 1,32 29,35 7.1,36 0.121,37 7,38 40,39 56.294,40 63.235,41 36.62,42 34.432,44 5.301}
{0 CHEMBL237964,1 6.79,2 40,3 50,4 0.994,5 1.13,6 0.646,7 0.606,8 339.48,9 6,10 12,11 50,13 13,14 27,16 52,17 20,20 12,21 8,22 1,24 25,25 5,28 3,29 2,32 25,35 4,36 0.096,37 5,38 34,39 49.68,40 56.481,41 32.302,42 30.289,44 5.301}
{0 CHEMBL237965,1 6.814,2 39.1,3 50,4 0.996,5 1.132,6 0.642,7 0.604,8 313.44,9 6.5,10 11,11 46,13 12,14 25,16 48,17 18,20 10,21 8,22 1,24 23,25 5,28 3,29 2,32 23,35 4.3,36 0.104,37 5,38 31.5,39 45.796,40 52.066,41 29.54,42 27.762,44 5.613}
{0 CHEMBL238184,1 6.99,2 42.3,3 48.1,4 0.994,5 1.125,6 0.66,7 0.621,8 363.5,9 5.8,10 16,11 52,13 17,14 30,16 55,17 22,20 14,21 8,22 1,24 25,25 5,28 3,29 2,32 27,35 3.8,36 0.091,37 5,38 39,39 51.68,40 58.481,41 34.302,42 32.289,44 5.305}
{0 CHEMBL246633,1 7.145,2 44.1,3 47.5,4 0.999,5 1.123,6 0.66,7 0.626,8 421.55,9 1.7,10 18,11 59,13 18,14 34,16 62,17 26,20 18,21 8,23 1,24 28,25 5,28 1,29 3,32 31,34 1,35 5.1,36 0.081,37 5,38 43,39 58.967,40 66.279,41 38.966,42 36.924,43 1.7,44 6.244}
{0 CHEMBL246634,1 7.578,2 41.2,3 45.1,4 1.015,5 1.132,6 0.65,7 0.629,8 386.46,9 3.9,10 12,11 51,13 13,14 31,16 54,17 21,20 13,21 8,22 1,23 1,24 23,25 7,28 2,29 4,32 28,34 1,35 7.8,36 0.074,37 4,38 38,39 51.745,40 57.741,41 33.142,42 32.08,43 2,44 7.387}
{0 CHEMBL246635,1 7.416,2 40.7,3 46.3,4 1.012,5 1.133,6 0.646,7 0.622,8 400.49,9 3.7,10 12,11 54,13 13,14 32,16 57,17 22,20 13,21 9,22 1,23 1,24 25,25 7,28 2,29 4,32 29,34 1,35 7.4,36 0.07,37 4,38 39,39 54.629,40 61.156,41 34.904,42 33.607,43 1.9,44 8.06}
{0 CHEMBL246815,1 7.264,2 40,3 47.3,4 1.007,5 1.135,6 0.645,7 0.617,8 399.51,9 5.5,10 12,11 55,13 13,14 32,16 58,17 22,20 13,21 9,22 1,23 1,24 26,25 7,28 3,29 3,32 29,34 1,35 5.5,36 0.069,37 4,38 39,39 55.403,40 62.445,41 35.455,42 33.914,43 1.8,44 8.041}
{0 CHEMBL246816,1 7.13,2 39.7,3 48.3,4 1.005,5 1.136,6 0.642,7 0.611,8 413.54,9 5.2,10 12,11 58,13 13,14 33,16 61,17 23,20 13,21 10,22 1,23 1,24 28,25 7,28 3,29 3,32 30,34 1,35 5.2,36 0.066,37 4,38 40,39 58.287,40 65.86,41 37.216,42 35.44,43 1.7,44 7.854}
{0 CHEMBL246817,1 6.822,2 40.6,3 50,4 0.996,5 1.126,6 0.645,7 0.606,8 436.6,9 3.1,10 12,11 64,13 13,14 36,16 68,17 26,20 13,21 13,22 1,24 32,25 6,28 2,29 4,32 32,35 6.3,36 0.059,37 4,38 43,39 63.767,40 72.062,41 41.25,42 38.804,44 7.824}
{0 CHEMBL246818,1 6.843,2 40,3 50,4 0.998,5 1.127,6 0.641,7 0.605,8 410.56,9 3.3,10 12,11 60,13 13,14 33,16 63,17 24,20 13,21 11,22 1,24 30,25 6,28 2,29 4,32 30,35 6.7,36 0.079,37 5,38 40,39 59.883,40 67.647,41 38.489,42 36.277,44 8.081}
{0 CHEMBL246819,1 7.255,2 41.5,3 47.2,4 1.006,5 1.131,6 0.65,7 0.621,8 384.49,9 3.8,10 12,11 53,13 13,14 31,16 56,17 22,20 13,21 9,22 1,23 1,24 25,25 6,28 2,29 3,32 28,34 1,35 5.7,36 0.071,37 4,38 38,39 53.301,40 59.947,41 34.449,42 32.892,43 1.9,44 8.257}
{0 CHEMBL247837,1 6.913,2 40.4,3 50,4 1.002,5 1.132,6 0.639,7 0.604,8 359.48,9 1.9,10 12,11 52,13 12,14 28,16 54,17 21,20 12,21 9,23 1,24 26,25 5,28 1,29 3,32 26,34 1,35 5.8,36 0.074,37 4,38 34,39 52.083,40 58.864,41 33.205,42 31.398,43 1.9,44 7.585}
{0 CHEMBL247838,1 6.913,2 40.4,3 50,4 1.002,5 1.132,6 0.639,7 0.604,8 359.48,9 1.9,10 12,11 52,13 12,14 28,16 54,17 21,20 12,21 9,23 1,24 26,25 5,28 1,29 3,32 26,34 1,35 5.8,36 0.074,37 4,38 34,39 52.083,40 58.864,41 33.205,42 31.398,43 1.9,44 7.796}
{0 CHEMBL247839,1 6.583,2 39.3,3 52.5,4 0.996,5 1.133,6 0.631,7 0.59,8 401.57,9 1.6,10 12,11 61,13 12,14 31,16 63,17 24,20 12,21 12,23 1,24 32,25 5,28 1,29 3,32 29,34 1,35 4.9,36 0.079,37 5,38 37,39 60.734,40 69.109,41 38.489,42 35.978,43 1.6,44 5.301}
{0 CHEMBL247840,1 6.687,2 40.7,3 50.8,4 0.992,5 1.126,6 0.645,7 0.603,8 394.56,9 3.4,10 12,11 59,13 13,14 32,16 62,17 24,20 13,21 11,22 1,24 30,25 5,28 2,29 3,32 29,35 5.1,36 0.065,37 4,38 39,39 58.556,40 66.438,41 38.034,42 35.562,44 8.041}
{0 CHEMBL247841,1 6.952,2 42.9,3 48.6,4 0.995,5 1.121,6 0.657,7 0.619,8 486.66,9 2.9,10 18,11 70,13 19,14 40,16 74,17 30,20 19,21 11,22 1,24 34,25 6,28 2,29 4,32 36,35 5.7,36 0.095,37 7,38 50,39 69.65,40 78.477,41 46.012,42 43.331,44 8.201}
{0 CHEMBL247842,1 7.41,2 41.1,3 48.2,4 1,5 1.124,6 0.663,7 0.623,8 414.97,9 3.6,10 12,11 56,13 13,14 32,16 59,17 23,18 1,20 13,21 10,22 1,24 27,25 6,26 1,28 2,29 3,32 29,34 1,35 5.4,36 0.068,37 4,38 39,39 55.996,40 62.966,41 37.131,42 34.863,43 1.8,44 8.18}
{0 CHEMBL248875,1 7.392,2 46.8,3 44.7,4 0.998,5 1.112,6 0.68,7 0.648,8 347.44,9 2.1,10 18,11 47,13 19,14 28,16 49,17 22,20 19,21 3,22 1,24 21,25 4,28 1,29 3,32 26,35 6.4,36 0.143,37 7,38 38,39 46.92,40 52.279,41 31.983,42 30.434,44 8.252}
{0 CHEMBL249093,1 6.683,2 38.8,3 51,4 0.993,5 1.132,6 0.639,7 0.598,8 327.47,9 6.1,10 11,11 49,13 12,14 26,16 51,17 19,20 10,21 9,22 1,24 25,25 5,28 3,29 2,32 24,35 4.1,36 0.137,37 7,38 32.5,39 48.68,40 55.481,41 31.302,42 29.289,44 8.377}
{0 CHEMBL249291,1 6.789,2 42,3 50,4 0.994,5 1.122,6 0.65,7 0.61,8 339.47,9 2,10 12,11 50,13 13,14 27,16 52,17 21,20 13,21 8,22 1,24 25,25 4,28 1,29 3,32 25,35 6,36 0.115,37 6,38 34,39 49.687,40 56.109,41 32.506,42 30.487,44 8.167}
{0 CHEMBL249297,1 6.814,2 39.1,3 50,4 0.996,5 1.132,6 0.642,7 0.604,8 313.44,9 6.5,10 11,11 46,13 12,14 25,16 48,17 18,20 10,21 8,22 1,24 23,25 5,28 3,29 2,32 23,35 4.3,36 0.125,37 6,38 31.5,39 45.796,40 52.066,41 29.54,42 27.762,44 7}
{0 CHEMBL249307,1 6.53,2 40,3 52,4 0.989,5 1.128,6 0.641,7 0.596,8 326.48,9 4,10 11,11 50,13 12,14 26,16 52,17 20,20 11,21 9,22 1,24 26,25 4,28 2,29 2,32 24,35 4,36 0.135,37 7,38 32.5,39 49.461,40 56.398,41 32.057,42 29.794,44 8.167}
{0 CHEMBL249311,1 7.349,2 41.5,3 47.2,4 1.011,5 1.136,6 0.644,7 0.619,8 389.48,9 1.9,10 12,11 53,13 13,14 30,16 55,17 22,20 13,21 9,22 1,23 2,24 25,25 6,28 1,29 3,32 28,34 2,35 5.7,36 0.127,37 7,38 37,39 53.596,40 60.204,41 34.142,42 32.781,43 3.8,44 8.071}
{0 CHEMBL249312,1 6.887,2 42.1,3 49.1,4 0.994,5 1.123,6 0.654,7 0.615,8 392.54,9 3.5,10 12,11 57,13 14,14 32,16 60,17 24,20 14,21 10,22 2,24 28,25 5,28 2,29 3,32 29,35 5.3,36 0.1,37 6,38 40,39 56.672,40 64.022,41 37.273,42 35.036,44 7.745}
{0 CHEMBL249715,1 6.843,2 37.5,3 50,4 0.998,5 1.137,6 0.636,7 0.6,8 328.46,9 8.3,10 11,11 48,13 12,14 26,16 50,17 18,20 10,21 8,22 1,24 24,25 6,28 4,29 2,32 24,35 4.2,36 0.12,37 6,38 32.5,39 47.898,40 54.564,41 30.546,42 28.783,44 7}
{0 CHEMBL249909,1 6.683,2 38.8,3 51,4 0.993,5 1.132,6 0.639,7 0.598,8 327.47,9 6.1,10 11,11 49,13 12,14 26,16 51,17 19,20 10,21 9,22 1,24 25,25 5,28 3,29 2,32 24,35 4.1,36 0.137,37 7,38 32.5,39 48.68,40 55.481,41 31.302,42 29.289,44 8.051}
{0 CHEMBL249920,1 6.715,2 37.3,3 51,4 0.996,5 1.137,6 0.633,7 0.594,8 342.49,9 7.8,10 11,11 51,13 12,14 27,16 53,17 19,20 10,21 9,22 1,24 26,25 6,28 4,29 2,32 25,35 3.9,36 0.132,37 7,38 33.5,39 50.781,40 57.979,41 32.307,42 30.31,44 8.432}
{0 CHEMBL250108,1 6.814,2 39.1,3 50,4 0.996,5 1.132,6 0.642,7 0.604,8 313.44,9 6.5,10 11,11 46,13 12,14 25,16 48,17 18,20 10,21 8,22 1,24 23,25 5,28 3,29 2,32 23,35 4.3,36 0.125,37 6,38 31.5,39 45.796,40 52.066,41 29.54,42 27.762,44 7.854}
{0 CHEMBL250114,1 6.97,2 39.2,3 49,4 1,5 1.131,6 0.642,7 0.608,8 355.48,9 5.9,10 12,11 51,13 13,14 28,16 53,17 20,20 11,21 9,22 1,24 25,25 6,28 3,29 3,32 26,35 5.9,36 0.132,37 7,38 35,39 51.007,40 57.69,41 32.756,42 31.003,44 8.252}
{0 CHEMBL251126,1 6.869,2 38,3 50,4 1,5 1.134,6 0.635,7 0.6,8 343.47,9 6,10 6,11 50,13 9,14 27,16 52,17 19,20 10,21 9,22 3,24 25,25 6,28 3,29 3,32 25,35 6,36 0.115,37 6,38 33,39 50.007,40 56.69,41 31.756,42 30.003,44 7}
{0 CHEMBL251127,1 6.745,2 37.7,3 50.9,4 0.998,5 1.134,6 0.632,7 0.595,8 357.5,9 5.7,10 6,11 53,13 9,14 28,16 55,17 20,20 10,21 10,22 3,24 27,25 6,28 3,29 3,32 26,35 5.7,36 0.127,37 7,38 34,39 52.891,40 60.106,41 33.517,42 31.53,44 7.959}
{0 CHEMBL251289,1 6.567,2 38.5,3 51.9,4 0.992,5 1.133,6 0.636,7 0.593,8 341.5,9 5.8,10 11,11 52,13 12,14 27,16 54,17 20,20 10,21 10,22 1,24 27,25 5,28 3,29 2,32 25,35 3.8,36 0.111,37 6,38 33.5,39 51.563,40 58.896,41 33.063,42 30.815,44 7}
{0 CHEMBL251496,1 6.464,2 38.2,3 52.7,4 0.99,5 1.133,6 0.633,7 0.588,8 355.53,9 5.5,10 11,11 55,13 12,14 28,16 57,17 21,20 10,21 11,22 1,24 29,25 5,28 3,29 2,32 26,35 3.6,36 0.123,37 7,38 34.5,39 54.447,40 62.311,41 34.824,42 32.342,44 7}
{0 CHEMBL255697,1 6.241,2 40.4,3 53.8,4 0.981,5 1.127,6 0.642,7 0.589,8 324.51,9 3.8,10 12,11 52,13 12,14 26,16 54,17 21,20 12,21 9,24 28,25 3,28 2,29 1,32 24,35 1.9,36 0.093,37 5,38 32,39 51.018,40 58.604,41 33.364,42 30.606,44 6.523}
{0 CHEMBL255895,1 7.147,2 43.1,3 47.1,4 0.998,5 1.121,6 0.662,7 0.627,8 364.48,9 3.9,10 12,11 51,13 16,14 29,16 53,17 22,20 15,21 7,22 4,24 24,25 5,28 2,29 3,32 27,35 5.9,36 0.132,37 7,38 39,39 50.905,40 57.192,41 33.75,42 31.982,44 6.606}
{0 CHEMBL256083,1 7.291,2 44,3 48,4 0.987,5 1.114,6 0.69,7 0.635,8 364.55,9 4,10 12,11 50,13 15,14 28,16 52,17 22,19 1,20 13,21 8,22 3,24 24,25 4,26 1,28 2,29 1,31 1,32 26,35 2,36 0.115,37 6,38 37,39 49.327,40 55.693,41 34.489,42 31.74,44 6.168}
{0 CHEMBL257783,1 6.727,2 43.5,3 50,4 0.989,5 1.119,6 0.658,7 0.614,8 309.44,9 2.2,10 12,11 46,13 13,14 25,16 48,17 20,20 13,21 7,22 1,24 23,25 3,28 1,29 2,32 23,35 4.3,36 0.104,37 5,38 32,39 45.476,40 51.484,41 30.29,42 28.246,44 6.851}
{0 CHEMBL257989,1 7.384,2 41.7,3 45.8,4 1.007,5 1.125,6 0.655,7 0.629,8 354.44,9 4.2,10 12,11 48,13 15,14 28,16 50,17 20,20 13,21 7,22 3,24 22,25 6,28 2,29 4,32 26,35 8.3,36 0.12,37 6,38 37,39 48.349,40 53.986,41 31.443,42 30.17,44 6.699}
{0 CHEMBL258032,1 6.489,2 41.7,3 52.1,4 0.987,5 1.123,6 0.647,7 0.599,8 311.46,9 2.1,10 12,11 48,13 12,14 25,16 50,17 20,20 12,21 8,24 25,25 3,28 1,29 2,32 23,35 4.2,36 0.1,37 5,38 31,39 47.36,40 53.9,41 31.052,42 28.773,44 7.208}
{0 CHEMBL305187,1 6.382,2 41.2,3 52.9,4 0.985,5 1.124,6 0.643,7 0.594,8 325.49,9 2,10 12,11 51,13 12,14 26,16 53,17 21,20 12,21 9,24 27,25 3,28 1,29 2,32 24,35 3.9,36 0.094,37 5,38 32,39 50.243,40 57.315,41 32.813,42 30.299,44 7.694}
{0 CHEMBL305195,1 6.287,2 40.7,3 53.7,4 0.984,5 1.125,6 0.64,7 0.589,8 339.52,9 1.9,10 12,11 54,13 12,14 27,16 56,17 22,20 12,21 10,24 29,25 3,28 1,29 2,32 25,35 3.7,36 0.107,37 6,38 33,39 53.127,40 60.73,41 34.574,42 31.826,44 6.799}
{0 CHEMBL333936,1 7.116,2 44.7,3 46.8,4 0.993,5 1.118,6 0.671,7 0.633,8 334.45,9 4.3,10 16,11 47,13 17,14 28,16 50,17 21,20 15,21 6,22 1,24 22,25 4,28 2,29 2,32 25,35 4.3,36 0.06,37 3,38 37,39 46.694,40 52.567,41 31.534,42 29.74,44 7.833}
{0 CHEMBL338104,1 7.282,2 45.5,3 45.5,4 0.996,5 1.117,6 0.677,7 0.641,8 320.42,9 4.5,10 16,11 44,13 17,14 27,16 47,17 20,20 15,21 5,22 1,24 20,25 4,28 2,29 2,32 24,35 4.5,36 0.043,37 2,38 36,39 43.811,40 49.152,41 29.773,42 28.214,44 5.097}
{0 CHEMBL339570,1 6.97,2 44,3 48,4 0.992,5 1.12,6 0.666,7 0.625,8 348.48,9 4,10 16,11 50,13 17,14 29,16 53,17 22,20 15,21 7,22 1,24 24,25 4,28 2,29 2,32 26,35 4,36 0.075,37 4,38 38,39 49.578,40 55.983,41 33.296,42 31.267,44 6.252}
{0 CHEMBL344151,1 6.916,2 50,3 46.9,4 0.978,5 1.106,6 0.698,7 0.647,8 221.32,9 3.1,10 12,11 32,13 12,14 20,16 35,17 16,20 12,21 4,24 15,25 1,28 1,32 17,38 26,39 31.287,40 35.405,41 22.336,42 20.709,44 4}
{0 CHEMBL373403,1 6.97,2 44,3 48,4 0.992,5 1.12,6 0.666,7 0.625,8 348.48,9 4,10 16,11 50,13 17,14 29,16 53,17 22,20 15,21 7,22 1,24 24,25 4,28 2,29 2,32 26,35 4,36 0.057,37 3,38 38,39 49.578,40 55.983,41 33.296,42 31.267,44 5.239}
{0 CHEMBL373890,1 6.944,2 45.9,3 47.5,4 0.986,5 1.116,6 0.678,7 0.633,8 423.6,9 4.9,10 22,11 61,13 23,14 36,16 65,17 28,20 21,21 7,22 1,24 29,25 4,28 3,29 1,32 32,35 1.6,36 0.092,37 6,38 48,39 60.12,40 68.102,41 41.37,42 38.627,44 6.719}
{0 CHEMBL373891,1 7.499,2 44.7,3 44.7,4 1.004,5 1.126,6 0.67,7 0.641,8 352.44,9 4.3,10 16,11 47,13 17,14 29,16 50,17 21,20 15,21 6,22 1,23 1,24 21,25 5,28 2,29 2,32 26,34 1,35 4.3,36 0.06,37 3,38 38,39 47.207,40 52.907,41 31.472,42 30.124,43 2.1,44 7.484}
{0 CHEMBL373907,1 8.499,2 43.1,3 37.3,4 1.026,5 1.126,6 0.679,7 0.674,8 433.46,9 9.8,10 16,11 51,13 19,14 37,16 56,17 22,20 16,21 6,22 3,24 19,25 10,28 5,29 5,32 32,35 9.8,36 0.054,37 3,38 48,39 52.331,40 57.445,41 34.631,42 34.369,44 6.484}
{0 CHEMBL373977,1 6.947,2 43.8,3 47.9,4 0.989,5 1.122,6 0.668,7 0.626,8 333.47,9 6.3,10 16,11 48,13 17,14 28,16 51,17 21,20 15,21 6,22 1,24 23,25 4,28 3,29 1,32 25,35 2.1,36 0.059,37 3,38 37,39 47.469,40 53.856,41 32.086,42 30.047,44 7.921}
{0 CHEMBL374011,1 7.662,2 44.9,3 42.9,4 1.005,5 1.12,6 0.678,7 0.652,8 375.46,9 6.1,10 16,11 49,13 18,14 32,16 53,17 22,20 16,21 6,22 2,24 21,25 6,28 3,29 3,32 28,35 6.1,36 0.057,37 3,38 42,39 49.24,40 54.86,41 33.233,42 31.95,44 7.704}
{0 CHEMBL374012,1 7.132,2 40.8,3 46.9,4 0.996,5 1.131,6 0.66,7 0.624,8 349.48,9 10.2,10 16,11 49,13 17,14 29,16 52,17 20,20 14,21 6,22 1,24 23,25 6,28 5,29 1,32 26,35 2,36 0.058,37 3,38 38,39 48.789,40 55.438,41 32.336,42 30.563,44 6.845}
{0 CHEMBL374433,1 7.641,2 45.7,3 45.7,4 0.993,5 1.108,6 0.699,7 0.65,8 351.5,9 2.2,10 16,11 46,13 17,14 28,16 49,17 21,20 15,21 6,22 1,24 21,25 4,26 1,28 1,29 2,31 1,32 25,35 4.3,36 0.061,37 3,38 37,39 45.669,40 50.989,41 32.176,42 29.906,44 5.126}
{0 CHEMBL374676,1 6.97,2 44,3 48,4 0.992,5 1.12,6 0.666,7 0.625,8 348.48,9 4,10 16,11 50,13 17,14 29,16 53,17 22,20 15,21 7,22 1,24 24,25 4,28 2,29 2,32 26,35 4,36 0.057,37 3,38 38,39 49.578,40 55.983,41 33.296,42 31.267,44 6.682}
{0 CHEMBL374793,1 7.147,2 43.1,3 47.1,4 0.998,5 1.121,6 0.662,7 0.627,8 364.48,9 3.9,10 16,11 51,13 17,14 30,16 54,17 22,20 15,21 7,22 1,24 24,25 5,28 2,29 3,32 27,35 5.9,36 0.074,37 4,38 39,39 50.905,40 57.192,41 33.75,42 31.982,44 7.434}
{0 CHEMBL374853,1 7.316,2 44.9,3 44.9,4 0.994,5 1.121,6 0.68,7 0.644,8 358.48,9 8.2,10 20,11 49,13 21,14 31,16 53,17 22,20 16,21 6,22 1,24 22,25 5,28 4,29 1,32 27,35 2,36 0.057,37 3,38 42,39 48.687,40 54.939,41 33.33,42 31.542,44 7.301}
{0 CHEMBL375615,1 8.619,2 42.2,3 40,4 1.022,5 1.124,6 0.684,7 0.666,8 387.85,9 6.7,10 16,11 45,13 17,14 30,16 48,17 19,18 1,20 14,21 5,22 1,24 18,25 8,26 1,28 3,29 4,32 27,34 1,35 8.9,36 0.063,37 3,38 39,39 46.007,40 50.598,41 30.784,42 29.965,43 2.2,44 7.854}
{0 CHEMBL375620,1 7.477,2 42.6,3 44.7,4 1.005,5 1.125,6 0.665,7 0.637,8 351.44,9 6.4,10 16,11 47,13 17,14 29,16 50,17 20,20 14,21 6,22 1,24 21,25 6,28 3,29 3,32 26,35 6.4,36 0.06,37 3,38 38,39 47.24,40 52.86,41 31.233,42 29.95,44 8.262}
{0 CHEMBL375805,1 6.947,2 43.8,3 47.9,4 0.989,5 1.122,6 0.668,7 0.626,8 333.47,9 6.3,10 16,11 48,13 17,14 28,16 51,17 21,20 15,21 6,22 1,24 23,25 4,28 3,29 1,32 25,35 2.1,36 0.059,37 3,38 37,39 47.469,40 53.856,41 32.086,42 30.047,44 6.225}
{0 CHEMBL375827,1 7.316,2 44.9,3 44.9,4 0.994,5 1.121,6 0.68,7 0.644,8 358.48,9 8.2,10 20,11 49,13 21,14 31,16 53,17 22,20 16,21 6,22 1,24 22,25 5,28 4,29 1,32 27,35 2,36 0.057,37 3,38 42,39 48.687,40 54.939,41 33.33,42 31.542,44 7.216}
{0 CHEMBL376694,1 7.833,2 44.4,3 44.4,4 0.997,5 1.113,6 0.698,7 0.653,8 352.49,9 4.4,10 16,11 45,13 17,14 28,16 48,17 20,20 14,21 6,22 1,24 20,25 5,26 1,28 2,29 2,31 1,32 25,35 4.4,36 0.063,37 3,38 37,39 44.887,40 50.072,41 31.421,42 29.401,44 5.586}
{0 CHEMBL380179,1 8.077,2 43.2,3 40.9,4 1.02,5 1.131,6 0.668,7 0.655,8 355.4,9 6.8,10 16,11 44,13 17,14 29,16 47,17 19,20 14,21 5,22 1,23 1,24 18,25 7,28 3,29 3,32 26,34 1,35 6.8,36 0.064,37 3,38 38,39 44.869,40 49.784,41 29.409,42 28.806,43 2.3,44 8.222}
{0 CHEMBL393609,1 6.864,2 41.8,3 49.1,4 0.992,5 1.125,6 0.656,7 0.615,8 377.53,9 5.5,10 16,11 55,13 17,14 31,16 58,17 23,20 14,21 9,22 1,24 27,25 5,28 3,29 2,32 28,35 3.6,36 0.086,37 5,38 40,39 54.563,40 61.896,41 36.063,42 33.815,44 6}
{0 CHEMBL395904,1 6.67,2 41.5,3 50.9,4 0.992,5 1.123,6 0.647,7 0.604,8 353.5,9 1.9,10 12,11 53,13 13,14 28,16 55,17 22,20 13,21 9,22 1,24 27,25 4,28 1,29 3,32 26,35 5.7,36 0.091,37 5,38 35,39 52.571,40 59.524,41 34.267,42 32.014,44 7.602}
{0 CHEMBL398127,1 6.814,2 39.1,3 50,4 0.996,5 1.132,6 0.642,7 0.604,8 313.44,9 6.5,10 11,11 46,13 12,14 25,16 48,17 18,20 10,21 8,22 1,24 23,25 5,28 3,29 2,32 23,35 4.3,36 0.104,37 5,38 31.5,39 45.796,40 52.066,41 29.54,42 27.762,44 5.301}
{0 CHEMBL398356,1 6.864,2 41.8,3 49.1,4 0.992,5 1.125,6 0.656,7 0.615,8 377.53,9 5.5,10 16,11 55,13 17,14 31,16 58,17 23,20 14,21 9,22 1,24 27,25 5,28 3,29 2,32 28,35 3.6,36 0.121,37 7,38 40,39 54.563,40 61.896,41 36.063,42 33.815,44 7.824}
{0 CHEMBL398357,1 6.648,2 40.4,3 51.1,4 0.991,5 1.127,6 0.645,7 0.601,8 312.45,9 4.3,10 11,11 47,13 12,14 25,16 49,17 19,20 11,21 8,22 1,24 24,25 4,28 2,29 2,32 23,35 4.3,36 0.122,37 6,38 31.5,39 46.578,40 52.983,41 30.296,42 28.267,44 7.076}
{0 CHEMBL399342,1 7.114,2 39.6,3 47.9,4 1.003,5 1.131,6 0.646,7 0.614,8 341.45,9 6.3,10 12,11 48,13 13,14 27,16 50,17 19,20 11,21 8,22 1,24 23,25 6,28 3,29 3,32 25,35 6.3,36 0.12,37 6,38 34,39 48.123,40 54.275,41 30.995,42 29.477,44 7}
{0 CHEMBL400917,1 7.669,2 46.8,3 42.6,4 1.003,5 1.114,6 0.686,7 0.658,8 360.44,9 4.3,10 18,11 47,13 20,14 29,16 49,17 22,20 20,21 2,22 2,24 20,25 5,28 2,29 3,32 27,35 6.4,36 0.122,37 6,38 40,39 47.138,40 52.362,41 32.228,42 30.928,44 7.824}
{0 CHEMBL400975,1 6.776,2 41.7,3 50,4 0.993,5 1.124,6 0.651,7 0.609,8 406.57,9 3.3,10 12,11 60,13 14,14 33,16 63,17 25,20 14,21 11,22 2,24 30,25 5,28 2,29 3,32 30,35 5,36 0.111,37 7,38 41,39 59.556,40 67.438,41 39.034,42 36.562,44 8.229}
{0 CHEMBL401406,1 7.753,2 40.8,3 46.9,4 1.011,5 1.13,6 0.659,7 0.626,8 379.89,9 2,10 12,11 49,13 12,14 28,16 51,17 20,18 1,20 12,21 8,23 1,24 23,25 6,26 1,28 1,29 3,32 26,34 2,35 6.1,36 0.078,37 4,38 34,39 49.523,40 55.393,41 32.301,42 30.698,43 4.1,44 8.252}
{0 CHEMBL401407,1 7.416,2 40.7,3 46.3,4 1.012,5 1.133,6 0.646,7 0.622,8 400.49,9 3.7,10 12,11 54,13 13,14 32,16 57,17 22,20 13,21 9,22 1,23 1,24 25,25 7,28 2,29 4,32 29,34 1,35 7.4,36 0.07,37 4,38 39,39 54.629,40 61.156,41 34.904,42 33.607,43 1.9,44 7.745}
{0 CHEMBL401688,1 7.254,2 41.8,3 49.1,4 0.994,5 1.123,6 0.667,7 0.621,8 398.97,9 3.6,10 12,11 55,13 14,14 30,16 57,17 23,18 1,20 14,21 9,22 2,24 27,25 5,26 1,28 2,29 2,32 28,34 1,35 3.6,36 0.105,37 6,38 38,39 54.669,40 61.757,41 36.677,42 34.148,43 1.8,44 6.307}
{0 CHEMBL401806,1 6.595,2 43.4,3 50.9,4 0.986,5 1.119,6 0.657,7 0.609,8 349.51,9 1.9,10 12,11 53,13 14,14 28,16 55,17 23,20 15,21 8,22 2,24 27,25 3,28 1,29 2,32 26,35 3.8,36 0.127,37 7,38 36,39 52.243,40 59.315,41 34.813,42 32.299,44 6.278}
{0 CHEMBL401882,1 6.628,2 41.8,3 50.9,4 0.988,5 1.124,6 0.651,7 0.606,8 364.53,9 3.6,10 12,11 55,13 14,14 29,16 57,17 23,20 14,21 9,22 2,24 28,25 4,28 2,29 2,32 27,35 3.6,36 0.105,37 6,38 37,39 54.345,40 61.813,41 35.819,42 33.321,44 6.971}
{0 CHEMBL402979,1 7.636,2 43.8,3 45.8,4 0.995,5 1.114,6 0.691,7 0.644,8 366.52,9 4.2,10 12,11 48,13 15,14 28,16 50,17 21,19 1,20 13,21 7,22 3,24 22,25 5,26 1,28 2,29 2,31 1,32 26,35 4.2,36 0.12,37 6,38 37,39 47.771,40 53.487,41 33.182,42 30.928,44 6.611}
{0 CHEMBL404851,1 7.116,2 41.1,3 48.2,4 1.003,5 1.131,6 0.647,7 0.615,8 398.52,9 3.6,10 12,11 56,13 13,14 32,16 59,17 23,20 13,21 10,22 1,23 1,24 27,25 6,28 2,29 3,32 29,34 1,35 5.4,36 0.068,37 4,38 39,39 56.185,40 63.362,41 36.211,42 34.419,43 1.8,44 7.959}
{0 CHEMBL404852,1 7.116,2 41.1,3 48.2,4 1.003,5 1.131,6 0.647,7 0.615,8 398.52,9 3.6,10 12,11 56,13 13,14 32,16 59,17 23,20 13,21 10,22 1,23 1,24 27,25 6,28 2,29 3,32 29,34 1,35 5.4,36 0.068,37 4,38 39,39 56.185,40 63.362,41 36.211,42 34.419,43 1.8,44 8}
{0 CHEMBL413998,1 6.45,2 42,3 52,4 0.983,5 1.124,6 0.652,7 0.602,8 322.49,9 4,10 12,11 50,13 13,14 26,16 52,17 21,20 13,21 8,22 1,24 26,25 3,28 2,29 1,32 24,35 2,36 0.096,37 5,38 33,39 49.134,40 56.188,41 32.603,42 30.079,44 7.237}
{0 CHEMBL419784,1 7.301,2 43.8,3 45.8,4 1,5 1.12,6 0.666,7 0.634,8 350.45,9 4.2,10 16,11 48,13 17,14 29,16 51,17 21,20 15,21 6,22 1,24 22,25 5,28 2,29 3,32 26,35 6.3,36 0.078,37 4,38 38,39 48.022,40 53.777,41 31.989,42 30.455,44 7.562}
{0 CHEMBL424752,1 8.29,2 36.1,3 44.3,4 1.017,5 1.13,6 0.672,7 0.637,8 505.68,9 8.2,10 16,11 61,13 21,14 37,16 64,17 22,20 14,21 8,22 5,24 27,25 12,26 2,28 5,29 5,31 2,32 34,35 8.2,36 0.109,37 7,38 50,39 62.018,40 68.946,41 40.972,42 38.85,44 8.705}
{0 CHEMBL426731,1 7.476,2 44.4,3 44.4,4 1.003,5 1.119,6 0.672,7 0.643,8 336.42,9 4.4,10 16,11 45,13 17,14 28,16 48,17 20,20 15,21 5,22 1,24 20,25 5,28 2,29 3,32 25,35 6.7,36 0.063,37 3,38 37,39 45.138,40 50.362,41 30.228,42 28.928,44 6.971}
{0 CHEMBL429297,1 6.67,2 41.5,3 50.9,4 0.992,5 1.123,6 0.647,7 0.604,8 353.5,9 1.9,10 12,11 53,13 13,14 28,16 55,17 22,20 13,21 9,22 1,24 27,25 4,28 1,29 3,32 26,35 5.7,36 0.127,37 7,38 35,39 52.571,40 59.524,41 34.267,42 32.014,44 7.699}
{0 CHEMBL436521,1 7.381,2 38.9,3 48.1,4 0.997,5 1.128,6 0.666,7 0.62,8 398.58,9 7.4,10 16,11 54,13 18,14 31,16 57,17 21,20 13,21 8,22 2,24 26,25 7,26 1,28 4,29 2,31 1,32 28,35 3.7,36 0.105,37 6,38 41,39 53.858,40 60.899,41 35.955,42 33.497,44 8.261}
{0 CHEMBL444384,1 6.785,2 44.9,3 49,4 0.985,5 1.118,6 0.67,7 0.624,8 332.48,9 4.1,10 16,11 49,13 17,14 28,16 52,17 22,20 15,21 7,22 1,24 24,25 3,28 2,29 1,32 25,35 2,36 0.096,37 5,38 37,39 48.251,40 54.773,41 32.841,42 30.552,44 6.114}
{0 CHEMBL447482,1 7.509,2 42,3 46,4 1.014,5 1.136,6 0.648,7 0.625,8 375.45,9 2,10 12,11 50,13 13,14 29,16 52,17 21,20 13,21 8,22 1,23 2,24 23,25 6,28 1,29 3,32 27,34 2,35 6,36 0.115,37 6,38 36,39 50.712,40 56.788,41 32.381,42 31.254,43 4,44 7.921}
{0 CHEMBL458155,1 7.397,2 44.9,3 44.9,4 1,5 1.118,6 0.673,7 0.642,8 362.46,9 4.1,10 16,11 49,13 18,14 30,16 52,17 22,20 16,21 6,22 2,24 22,25 5,28 2,29 3,32 27,35 6.1,36 0.077,37 4,38 40,39 49.022,40 54.777,41 32.989,42 31.455,44 5.575}
{0 CHEMBL518480,1 6.97,2 44,3 48,4 0.992,5 1.12,6 0.666,7 0.625,8 348.48,9 4,10 16,11 50,13 17,14 29,16 53,17 22,20 15,21 7,22 1,24 24,25 4,28 2,29 2,32 26,35 4,36 0.094,37 5,38 38,39 49.578,40 55.983,41 33.296,42 31.267,44 7.62}
{0 CHEMBL524338,1 7.445,2 32,3 47.5,4 1.026,5 1.148,6 0.608,7 0.595,8 2352.77,9 8.2,10 17,11 316,13 46,14 168,16 318,17 101,20 44,21 57,22 29,24 150,25 65,28 26,29 39,32 166,35 12.3,36 0.248,37 79,38 205.5,39 324.195,40 362.865,41 192.08,42 188.095,44 6.699}
{0 CHEMBL524886,1 7.404,2 30.5,3 48.9,4 1.023,5 1.149,6 0.608,7 0.588,8 3057.83,9 8.2,10 6,11 413,13 44,14 212,16 414,17 126,20 44,21 82,22 38,24 202,25 85,26 3,28 34,29 48,31 3,32 211,35 11.6,36 0.249,37 103,38 253,39 422.623,40 474.63,41 250.91,42 242.85,44 6}
{0 CHEMBL525025,1 7.65,2 29.7,3 46.6,4 1.036,5 1.153,6 0.597,7 0.593,8 2264.52,9 8.8,11 296,13 33,14 157,16 295,17 88,20 33,21 55,22 33,24 138,25 70,28 26,29 44,32 158,35 14.9,36 0.275,37 81,38 190,39 306.53,40 341.421,41 176.785,42 175.508,44 7}
{0 CHEMBL525783,1 7.399,2 32.4,3 47.7,4 1.025,5 1.147,6 0.609,7 0.595,8 2463.92,9 7.5,10 18,11 333,13 47,14 177,16 336,17 108,20 47,21 61,22 29,24 159,25 66,28 25,29 41,32 174,35 12.3,36 0.238,37 80,38 215,39 341.166,40 381.861,41 202.791,42 198.137,44 6.301}
{0 CHEMBL526324,1 7.422,2 30.8,3 47.8,4 1.027,5 1.151,6 0.603,7 0.591,8 2189.59,9 9.2,10 10,11 295,13 38,14 156,16 297,17 91,20 36,21 55,22 28,24 141,25 63,28 27,29 36,32 154,35 12.2,36 0.239,37 71,38 189,39 302.897,40 339.659,41 177.916,42 174.338,44 6.301}
{0 CHEMBL594417,1 9.168,2 38,3 42,4 1.023,5 1.126,6 0.696,7 0.661,8 458.4,9 6,10 12,11 50,13 15,14 31,16 52,17 19,18 2,20 13,21 6,22 3,24 21,25 10,26 3,28 3,29 4,31 1,32 29,34 2,35 8,36 0.115,37 6,38 40,39 51.174,40 56.293,41 34.813,42 33.034,43 4,44 6.088}
{0 CHEMBL596036,1 9.455,2 38.3,3 40.4,4 1.027,5 1.125,6 0.703,7 0.67,8 444.37,9 6.4,10 12,11 47,13 15,14 30,16 49,17 18,18 2,20 13,21 5,22 3,24 19,25 10,26 3,28 3,29 4,31 1,32 28,34 2,35 8.5,36 0.143,37 7,38 39,39 48.291,40 52.877,41 33.051,42 31.507,43 4.3,44 6.523}
{0 CHEMBL607819,1 9.399,2 37,3 41.3,4 1.028,5 1.128,6 0.697,7 0.663,8 432.36,9 6.5,10 12,11 46,13 15,14 28,16 47,17 17,18 2,20 13,21 4,22 3,24 19,25 10,26 3,28 3,29 4,31 1,32 27,34 2,35 8.7,36 0.191,37 9,38 37,39 47.291,40 51.877,41 32.051,42 30.507,43 4.3,44 6.924}
{0 CHEMBL65231,1 6.84,2 42.6,3 48.9,4 0.989,5 1.125,6 0.661,7 0.618,8 321.46,9 6.4,10 16,11 47,13 16,14 27,16 50,17 20,20 13,21 7,24 23,25 4,28 3,29 1,32 24,35 2.1,36 0.08,37 4,38 35,39 46.469,40 52.856,41 31.086,42 29.047,44 8.51}
{0 CHEMBL659,1 6.843,2 40.5,3 50,4 0.998,5 1.126,6 0.642,7 0.606,8 287.39,9 2.4,10 6,11 42,13 7,14 24,16 45,17 17,20 8,21 9,22 1,24 21,25 4,28 1,29 3,32 21,35 7.1,36 0.022,37 1,38 28,39 41.92,40 47.279,41 26.983,42 25.434,44 4}
{0 CHEMBL70918,1 6.464,2 40,3 52.7,4 0.99,5 1.126,6 0.637,7 0.592,8 355.52,9 1.8,10 12,11 55,13 12,14 28,16 57,17 22,20 12,21 10,24 29,25 4,28 1,29 3,32 26,35 5.5,36 0.105,37 6,38 34,39 54.454,40 61.939,41 35.029,42 32.541,44 7.721}
{0 CHEMBL807,1 5.275,2 35.3,3 61.8,4 0.969,5 1.137,6 0.606,7 0.538,8 179.34,9 2.9,11 34,14 15,16 36,17 12,21 12,24 21,25 1,28 1,32 13,38 15,39 32.938,40 38.65,41 20.62,42 18.289,44 4}
