"molecule_id","AMW","C.","H.","Me","Mi","Mp","Mv","MW","N.","nAB","nAT","nB","nBM","nBO","nBR","nBT","nC","nCL","nCsp","nCsp2","nCsp3","nDB","nF","nH","nHet","nHM","nI","nN","nO","nP","nS","nSK","nTB","nX","O.","RBF","RBN","SCBO","Se","Si","Sp","Sv","X.","pXC50"
{1 8.05,2 36.5,3 43.8,4 1.037,5 1.158,6 0.623,7 0.62,8 772.83,9 6.3,10 12,11 96,13 17,14 57,16 99,17 35,20 17,21 18,22 5,23 6,24 42,25 19,28 6,29 7,32 54,34 6,35 7.3,36 0.071,37 7,38 68,39 99.534,40 111.213,41 59.83,42 59.495,43 6.3,44 5.699}
{0 CHEMBL115263,1 7.848,2 37,3 44.4,4 1.029,5 1.149,6 0.629,7 0.62,8 635.71,9 6.2,10 12,11 81,13 17,14 47,16 83,17 30,20 17,21 13,22 5,23 3,24 36,25 15,28 5,29 7,32 45,34 3,35 8.6,36 0.084,37 7,38 58,39 83.359,40 93.035,41 50.966,42 50.216,43 3.7,44 5.699}
{0 CHEMBL146289,1 8.71,2 40,3 40,4 1.028,5 1.122,6 0.682,7 0.662,8 348.41,9 5,10 12,11 40,13 15,14 26,16 42,17 16,20 13,21 3,22 3,24 16,25 8,26 1,28 2,29 5,31 1,32 24,35 12.5,36 0.071,37 3,38 35,39 41.102,40 44.87,41 27.261,42 26.492,44 6.735}
{0 CHEMBL146718,1 8.082,2 42.9,3 42.9,4 1.011,5 1.117,6 0.684,7 0.654,8 452.57,9 3.6,10 18,11 56,13 21,14 35,16 59,17 24,20 19,21 5,22 3,24 24,25 8,26 1,28 2,29 5,31 1,32 32,35 8.9,36 0.102,37 6,38 47,39 56.636,40 62.531,41 38.307,42 36.599,44 7.252}
{0 CHEMBL147489,1 9.367,2 38.1,3 35.7,4 1.047,5 1.128,6 0.677,7 0.677,8 393.41,9 7.1,10 12,11 42,13 17,14 29,16 44,17 16,20 13,21 3,22 5,24 15,25 11,26 1,28 3,29 7,31 1,32 27,35 16.7,36 0.091,37 4,38 40,39 43.975,40 47.372,41 28.415,42 28.416,44 6.752}
{0 CHEMBL147604,1 9.574,2 43.4,3 37.7,4 1.026,5 1.113,6 0.722,7 0.693,8 507.42,9 3.8,10 18,11 53,13 21,14 36,16 56,17 23,18 2,20 19,21 4,22 3,24 20,25 10,26 3,28 2,29 5,31 1,32 33,34 2,35 9.4,36 0.107,37 6,38 48,39 54.4,40 59.004,41 38.261,42 36.727,43 3.8,44 5.334}
{0 CHEMBL147881,1 8.274,2 43.4,3 41.5,4 1.014,5 1.115,6 0.69,7 0.662,8 438.54,9 3.8,10 18,11 53,13 21,14 34,16 56,17 23,20 19,21 4,22 3,24 22,25 8,26 1,28 2,29 5,31 1,32 31,35 9.4,36 0.107,37 6,38 46,39 53.753,40 59.116,41 36.546,42 35.072,44 7.456}
{0 CHEMBL147882,1 8.429,2 39.5,3 41.9,4 1.023,5 1.123,6 0.675,7 0.652,8 362.44,9 4.7,10 12,11 43,13 15,14 27,16 45,17 17,20 13,21 4,22 3,24 18,25 8,26 1,28 2,29 5,31 1,32 25,35 11.6,36 0.067,37 3,38 36,39 43.985,40 48.285,41 29.023,42 28.018,44 7.678}
{0 CHEMBL148169,1 7.348,2 42.4,3 45.8,4 1.004,5 1.124,6 0.661,7 0.631,8 433.55,9 5.1,10 17,11 59,13 19,14 35,16 62,17 25,20 17,21 8,22 2,24 27,25 7,28 3,29 4,32 32,35 6.8,36 0.097,37 6,38 45.5,39 59.218,40 66.315,41 38.972,42 37.245,44 5.796}
{0 CHEMBL148171,1 8.601,2 38.6,3 40.9,4 1.03,5 1.125,6 0.67,7 0.653,8 378.44,9 4.5,10 12,11 44,13 15,14 28,16 46,17 17,20 13,21 4,22 3,24 18,25 9,26 1,28 2,29 6,31 1,32 26,35 13.6,36 0.087,37 4,38 37,39 45.313,40 49.495,41 29.477,42 28.733,44 7.398}
{0 CHEMBL148214,1 8.51,2 37.5,3 41.7,4 1.032,5 1.127,6 0.66,7 0.645,8 408.47,9 4.2,10 12,11 48,13 15,14 30,16 50,17 18,20 13,21 5,22 3,24 20,25 10,26 1,28 2,29 7,31 1,32 28,35 14.6,36 0.1,37 5,38 39,39 49.524,40 54.119,41 31.693,42 30.975,44 7.796}
{0 CHEMBL148406,1 8.653,2 38.1,3 40.5,4 1.029,5 1.128,6 0.673,7 0.655,8 363.43,9 7.1,10 12,11 42,13 15,14 27,16 44,17 16,20 13,21 3,22 3,24 17,25 9,26 1,28 3,29 5,31 1,32 25,35 11.9,36 0.068,37 3,38 36,39 43.204,40 47.368,41 28.267,42 27.513,44 6.695}
{0 CHEMBL179288,1 7.529,2 37,3 48.1,4 1.01,5 1.129,6 0.649,7 0.613,8 406.55,9 3.7,10 12,11 54,13 15,14 29,16 55,17 20,20 13,21 7,22 3,24 26,25 8,26 1,28 2,29 5,31 1,32 28,35 9.3,36 0.145,37 8,38 38,39 54.52,40 60.946,41 35.068,42 33.126,44 7.292}
{0 CHEMBL181244,1 8.099,2 37.8,3 44.4,4 1.019,5 1.127,6 0.662,7 0.634,8 364.46,9 4.4,10 12,11 45,13 15,14 26,16 46,17 17,20 13,21 4,22 3,24 20,25 8,26 1,28 2,29 5,31 1,32 25,35 11.1,36 0.152,37 7,38 35,39 45.869,40 50.7,41 29.784,42 28.545,44 6.046}
{0 CHEMBL1939844,1 8.351,2 34.1,3 43.9,4 1.032,5 1.134,6 0.646,7 0.628,8 342.41,9 4.9,10 6,11 41,13 10,14 24,16 42,17 14,20 8,21 6,22 4,24 18,25 9,26 1,28 2,29 6,31 1,32 23,35 14.6,36 0.095,37 4,38 31,39 42.313,40 46.495,41 26.477,42 25.733,44 5.959}
{0 CHEMBL1939845,1 8.266,2 40.4,3 42.6,4 1.018,5 1.121,6 0.676,7 0.65,8 388.48,9 4.3,10 12,11 47,13 16,14 29,16 49,17 19,20 14,21 5,22 4,24 20,25 8,26 1,28 2,29 5,31 1,32 27,35 10.6,36 0.082,37 4,38 39,39 47.869,40 52.7,41 31.784,42 30.545,44 5.658}
{0 CHEMBL1939846,1 8.427,2 39.6,3 41.7,4 1.025,5 1.123,6 0.672,7 0.651,8 404.48,9 4.2,10 12,11 48,13 16,14 30,16 50,17 19,20 14,21 5,22 4,24 20,25 9,26 1,28 2,29 6,31 1,32 28,35 12.5,36 0.1,37 5,38 40,39 49.196,40 53.91,41 32.239,42 31.26,44 7.409}
{0 CHEMBL1956115,1 7.722,2 40,3 46.7,4 1.007,5 1.12,6 0.669,7 0.63,8 347.47,9 2.2,10 12,11 45,13 15,14 25,16 46,17 18,20 13,21 5,22 3,24 21,25 6,26 1,28 1,29 4,31 1,32 24,35 8.9,36 0.13,37 6,38 34,39 45.323,40 50.408,41 30.085,42 28.336,44 5}
{0 CHEMBL19611,1 6.938,2 35.7,3 50,4 1.006,5 1.14,6 0.625,7 0.594,8 388.52,9 7.1,10 10,11 56,13 13,14 29,16 57,17 20,20 11,21 9,22 3,24 28,25 8,28 4,29 4,32 28,35 7.1,36 0.158,37 9,38 37,39 56.32,40 63.813,41 34.978,42 33.266,44 8.097}
{0 CHEMBL202875,1 7.473,2 48.8,3 43.9,4 0.998,5 1.106,6 0.688,7 0.656,8 306.38,10 12,11 41,13 15,14 24,16 42,17 20,19 2,20 14,21 4,22 2,24 18,25 3,29 3,32 23,33 1,35 7.3,36 0.119,37 5,38 34,39 40.934,40 45.365,41 28.216,42 26.886,44 4.494}
{0 CHEMBL207305,1 7.492,2 41.7,3 45,4 1.009,5 1.125,6 0.657,7 0.633,8 449.55,9 5,10 17,11 60,13 19,14 36,16 63,17 25,20 17,21 8,22 2,24 27,25 8,28 3,29 5,32 33,35 8.3,36 0.111,37 7,38 46.5,39 60.545,40 67.524,41 39.426,42 37.96,44 5.255}
{0 CHEMBL208009,1 7.354,2 41,3 45.9,4 1.005,5 1.128,6 0.655,7 0.627,8 448.57,9 6.6,10 17,11 61,13 19,14 36,16 64,17 25,20 17,21 8,22 2,24 28,25 8,28 4,29 4,32 33,35 6.6,36 0.109,37 7,38 46.5,39 61.32,40 68.813,41 39.978,42 38.266,44 5.255}
{0 CHEMBL234529,1 8.783,2 33.3,3 42.1,4 1.035,5 1.134,6 0.659,7 0.639,8 500.61,9 7,10 12,11 57,13 18,14 34,16 58,17 19,20 14,21 5,22 6,24 24,25 14,26 2,28 4,29 8,31 2,32 33,35 14,36 0.19,37 11,38 46,39 59.014,40 64.66,41 37.568,42 36.446,44 7.357}
{0 CHEMBL234530,1 8.792,2 37.5,3 40.6,4 1.03,5 1.126,6 0.677,7 0.656,8 562.68,9 6.3,10 18,11 64,13 24,14 40,16 66,17 24,20 20,21 4,22 6,24 26,25 14,26 2,28 4,29 8,31 2,32 38,35 12.5,36 0.182,37 12,38 55,39 65.898,40 72.076,41 43.33,42 41.973,44 9}
{0 CHEMBL234735,1 8.677,2 38.1,3 41.3,4 1.025,5 1.125,6 0.681,7 0.655,8 546.68,9 6.3,10 18,11 63,13 24,14 39,16 65,17 24,20 20,21 4,22 6,24 26,25 13,26 2,28 4,29 7,31 2,32 37,35 11.1,36 0.169,37 11,38 54,39 64.571,40 70.866,41 42.875,42 41.258,44 6.73}
{0 CHEMBL253275,1 8.564,2 40.7,3 38.9,4 1.039,5 1.148,6 0.653,7 0.655,8 462.47,9 7.4,10 16,11 54,13 18,14 36,16 57,17 22,20 15,21 7,22 2,23 3,24 21,25 11,28 4,29 4,32 33,34 3,35 7.4,36 0.088,37 5,38 46,39 56.091,40 62.002,41 35.267,42 35.363,43 5.6,44 5}
{0 CHEMBL325163,1 7.672,2 37,3 45.7,4 1.025,5 1.147,6 0.627,7 0.614,8 705.81,9 5.4,10 12,11 92,13 17,14 53,16 95,17 34,20 17,21 17,22 5,23 3,24 42,25 16,28 5,29 8,32 50,34 3,35 8.7,36 0.074,37 7,38 64,39 94.338,40 105.49,41 57.705,42 56.511,43 3.3,44 5.699}
{0 CHEMBL356124,1 8.601,2 38.6,3 40.9,4 1.03,5 1.125,6 0.67,7 0.653,8 378.44,9 4.5,10 12,11 44,13 15,14 28,16 46,17 17,20 13,21 4,22 3,24 18,25 9,26 1,28 2,29 6,31 1,32 26,35 13.6,36 0.087,37 4,38 37,39 45.313,40 49.495,41 29.477,42 28.733,44 5.775}
{0 CHEMBL358539,1 8.221,2 42.1,3 42.1,4 1.017,5 1.118,6 0.68,7 0.655,8 468.57,9 3.5,10 18,11 57,13 21,14 36,16 60,17 24,20 19,21 5,22 3,24 24,25 9,26 1,28 2,29 6,31 1,32 33,35 10.5,36 0.117,37 7,38 48,39 57.963,40 63.74,41 38.761,42 37.313,44 7.658}
{0 CHEMBL402436,1 7.731,2 38.2,3 45.6,4 1.01,5 1.13,6 0.66,7 0.628,8 525.69,9 7.4,10 16,11 68,13 19,14 40,16 71,17 26,20 16,21 10,22 3,24 31,25 11,26 1,28 5,29 5,31 1,32 37,35 7.4,36 0.113,37 8,38 51,39 68.709,40 76.856,41 44.847,42 42.716,44 5.263}
{0 CHEMBL403186,1 7.367,2 38.8,3 46.3,4 1.009,5 1.133,6 0.645,7 0.62,8 493.62,9 7.5,10 16,11 67,13 19,14 39,16 70,17 26,20 16,21 10,22 3,24 31,25 10,28 5,29 5,32 36,35 7.5,36 0.1,37 7,38 50,39 67.632,40 75.936,41 43.199,42 41.529,44 5.255}
{0 CHEMBL424130,1 10.432,2 40,3 35,4 1.044,5 1.119,6 0.724,7 0.704,8 417.29,9 5,10 12,11 40,13 15,14 28,16 42,17 16,18 2,20 13,21 3,22 3,24 14,25 10,26 3,28 2,29 5,31 1,32 26,34 2,35 12.5,36 0.071,37 3,38 37,39 41.749,40 44.758,41 28.977,42 28.147,43 5,44 5.735}
{0 CHEMBL431680,1 7.579,2 36.6,3 46.2,4 1.023,5 1.148,6 0.626,7 0.611,8 704.83,9 6.5,10 12,11 93,13 17,14 53,16 96,17 34,20 17,21 17,22 5,23 3,24 43,25 16,28 6,29 7,32 50,34 3,35 7.5,36 0.073,37 7,38 64,39 95.112,40 106.779,41 58.256,42 56.818,43 3.2,44 5.699}
{0 CHEMBL447787,1 7.146,2 38.4,3 47.9,4 1.005,5 1.134,6 0.64,7 0.611,8 521.68,9 6.8,10 16,11 73,13 19,14 41,16 76,17 28,20 16,21 12,22 3,24 35,25 10,28 5,29 5,32 38,35 6.8,36 0.105,37 8,38 52,39 73.4,40 82.767,41 46.722,42 44.583,44 5.255}
{0 CHEMBL471537,1 8.285,2 37,3 43.8,4 1.021,5 1.128,6 0.666,7 0.638,8 604.77,9 5.5,10 18,11 73,13 24,14 43,16 75,17 27,20 20,21 7,22 6,24 32,25 14,26 2,28 4,29 8,31 2,32 41,35 11,36 0.173,37 13,38 58,39 74.549,40 82.321,41 48.614,42 46.553,44 9.509}
{0 CHEMBL472899,1 9.057,2 38.1,3 38.1,4 1.042,5 1.126,6 0.671,7 0.665,8 380.41,9 4.8,10 12,11 42,13 16,14 27,16 43,17 16,20 14,21 2,22 4,24 16,25 10,26 1,28 2,29 7,31 1,32 26,35 16.7,36 0.186,37 8,38 37,39 43.756,40 47.289,41 28.17,42 27.921,44 7.943}
{0 CHEMBL514138,1 7.87,2 36,3 46,4 1.017,5 1.132,6 0.651,7 0.622,8 393.51,9 6,10 12,11 50,13 15,14 28,16 51,17 18,20 12,21 6,22 3,24 23,25 9,26 1,28 3,29 5,31 1,32 27,35 10,36 0.157,37 8,38 37,39 50.854,40 56.614,41 32.551,42 31.093,44 8.167}
{0 CHEMBL515083,1 9.095,2 31.4,3 40,4 1.054,5 1.139,6 0.64,7 0.64,8 318.34,9 5.7,10 6,11 35,13 10,14 21,16 35,17 11,20 8,21 3,22 4,24 14,25 10,26 1,28 2,29 7,31 1,32 21,35 20,36 0.2,37 7,38 28,39 36.873,40 39.874,41 22.409,42 22.394,44 6.002}
{0 CHEMBL515980,1 8.284,2 37.3,3 43.1,4 1.028,5 1.128,6 0.656,7 0.637,8 422.5,9 3.9,10 12,11 51,13 16,14 30,16 52,17 19,20 14,21 5,22 4,24 22,25 10,26 1,28 2,29 7,31 1,32 29,35 13.7,36 0.173,37 9,38 40,39 52.407,40 57.534,41 33.455,42 32.502,44 8.807}
{0 CHEMBL550350,1 8.56,2 40.7,3 42.4,4 1.02,5 1.12,6 0.684,7 0.655,8 505.03,9 3.4,10 18,11 59,13 21,14 36,16 61,17 24,18 1,20 19,21 5,22 3,24 25,25 10,26 2,28 2,29 6,31 1,32 34,34 1,35 10.2,36 0.164,37 10,38 48,39 60.171,40 66.099,41 40.381,42 38.668,43 1.7,44 4.824}
{0 CHEMBL550548,1 8.046,2 39.7,3 45.6,4 1.012,5 1.123,6 0.672,7 0.636,8 547.12,9 2.9,10 18,11 68,13 21,14 39,16 70,17 27,18 1,20 19,21 8,22 3,24 31,25 10,26 2,28 2,29 6,31 1,32 37,34 1,35 8.8,36 0.157,37 11,38 51,39 68.822,40 76.345,41 45.665,42 43.248,43 1.5,44 5.301}
{0 CHEMBL561963,1 7.121,2 36.5,3 50.8,4 1.003,5 1.13,6 0.641,7 0.599,8 448.64,9 3.2,10 12,11 63,13 15,14 32,16 64,17 23,20 13,21 10,22 3,24 32,25 8,26 1,28 2,29 5,31 1,32 31,35 7.9,36 0.141,37 9,38 41,39 63.171,40 71.192,41 40.353,42 37.706,44 7.292}
{0 CHEMBL572780,1 8.23,2 44,3 42,4 1.013,5 1.112,6 0.691,7 0.661,8 411.51,9 2,10 18,11 50,13 21,14 31,16 52,17 22,20 19,21 3,22 3,24 21,25 7,26 1,28 1,29 5,31 1,32 29,35 10,36 0.115,37 6,38 43,39 50.651,40 55.617,41 34.54,42 33.051,44 6.824}
{0 CHEMBL573714,1 8.686,2 40.5,3 40.5,4 1.027,5 1.118,6 0.683,7 0.661,8 321.38,9 2.7,10 12,11 37,13 15,14 23,16 38,17 15,20 13,21 2,22 3,24 15,25 7,26 1,28 1,29 5,31 1,32 22,35 13.5,36 0.132,37 5,38 32,39 38,40 41.372,41 25.256,42 24.47,44 6.886}
{0 CHEMBL573715,1 8.614,2 43.8,3 39.6,4 1.023,5 1.113,6 0.692,7 0.672,8 413.48,9 2.1,10 18,11 48,13 21,14 31,16 50,17 21,20 19,21 2,22 3,24 19,25 8,26 1,28 1,29 6,31 1,32 29,35 12.5,36 0.14,37 7,38 43,39 49.094,40 53.412,41 33.233,42 32.239,44 7.495}
{0 CHEMBL573934,1 8.715,2 45.5,3 38.6,4 1.02,5 1.109,6 0.705,7 0.682,8 383.45,9 2.3,10 18,11 44,13 21,14 29,16 46,17 20,20 19,21 1,22 3,24 17,25 7,26 1,28 1,29 5,31 1,32 27,35 11.4,36 0.109,37 5,38 41,39 44.884,40 48.787,41 31.017,42 29.997,44 5.921}
{0 CHEMBL573935,1 8.596,2 48.8,3 39,4 1.011,5 1.099,6 0.721,7 0.689,8 352.43,10 18,11 41,13 21,14 27,16 43,17 20,20 19,21 1,22 3,24 16,25 5,26 1,29 4,31 1,32 25,35 9.8,36 0.116,37 5,38 39,39 41.454,40 45.079,41 29.557,42 28.261,44 5.367}
{0 CHEMBL573936,1 8.499,2 46.7,3 40,4 1.015,5 1.105,6 0.706,7 0.678,8 382.46,10 18,11 45,13 21,14 29,16 47,17 21,20 19,21 2,22 3,24 18,25 6,26 1,29 5,31 1,32 27,35 11.1,36 0.128,37 6,38 41,39 45.665,40 49.704,41 31.773,42 30.502,44 6.137}
{0 CHEMBL574370,1 8.545,2 46.5,3 39.5,4 1.013,5 1.106,6 0.711,7 0.681,8 367.45,9 2.3,10 18,11 43,13 21,14 28,16 45,17 20,20 19,21 1,22 3,24 17,25 6,26 1,28 1,29 4,31 1,32 26,35 9.3,36 0.111,37 5,38 40,39 43.556,40 47.578,41 30.563,42 29.282,44 6.658}
{0 CHEMBL574589,1 8.835,2 47.5,3 37.5,4 1.017,5 1.104,6 0.72,7 0.694,8 353.42,9 2.5,10 18,11 40,13 21,14 27,16 42,17 19,20 19,22 3,24 15,25 6,26 1,28 1,29 4,31 1,32 25,35 10,36 0.095,37 4,38 39,39 40.673,40 44.162,41 28.801,42 27.755,44 5.292}
{0 CHEMBL574605,1 8.293,2 45.7,3 41.3,4 1.01,5 1.109,6 0.703,7 0.67,8 381.48,9 2.2,10 18,11 46,13 21,14 29,16 48,17 21,20 19,21 2,22 3,24 19,25 6,26 1,28 1,29 4,31 1,32 27,35 8.7,36 0.104,37 5,38 41,39 46.44,40 50.993,41 32.324,42 30.809,44 6.328}
{0 CHEMBL575881,1 7.529,2 38.5,3 48.1,4 1.008,5 1.124,6 0.655,7 0.617,8 391.53,9 1.9,10 12,11 52,13 15,14 28,16 53,17 20,20 13,21 7,22 3,24 25,25 7,26 1,28 1,29 5,31 1,32 27,35 9.6,36 0.151,37 8,38 37,39 52.418,40 58.448,41 34.063,42 32.104,44 4.745}
{0 CHEMBL575895,1 9.04,2 41.2,3 38.2,4 1.033,5 1.116,6 0.691,7 0.675,8 307.35,9 2.9,10 12,11 34,13 15,14 22,16 35,17 14,20 13,21 1,22 3,24 13,25 7,26 1,28 1,29 5,31 1,32 21,35 14.7,36 0.114,37 4,38 31,39 35.116,40 37.957,41 23.494,42 22.943,44 4.509}
{0 CHEMBL575896,1 9.01,2 46.3,3 36.6,4 1.024,5 1.107,6 0.714,7 0.694,8 369.42,9 2.4,10 18,11 41,13 21,14 28,16 43,17 19,20 19,22 3,24 15,25 7,26 1,28 1,29 5,31 1,32 26,35 12.2,36 0.116,37 5,38 40,39 42,40 45.372,41 29.256,42 28.47,44 5.886}
{0 CHEMBL579067,1 8.662,2 45.7,3 39.1,4 1.022,5 1.107,6 0.701,7 0.679,8 398.46,10 18,11 46,13 21,14 30,16 48,17 21,20 19,21 2,22 3,24 18,25 7,26 1,29 6,31 1,32 28,35 13,36 0.146,37 7,38 42,39 46.993,40 50.913,41 32.227,42 31.217,44 5.187}
{0 CHEMBL579068,1 8.329,2 47.7,3 40.9,4 1.008,5 1.102,6 0.712,7 0.677,8 366.46,10 18,11 44,13 21,14 28,16 46,17 21,20 19,21 2,22 3,24 18,25 5,26 1,29 4,31 1,32 26,35 9.1,36 0.109,37 5,38 40,39 44.338,40 48.494,41 31.318,42 29.788,44 5.201}
{0 CHEMBL584122,1 8.877,2 44.4,3 37.8,4 1.027,5 1.111,6 0.699,7 0.682,8 399.45,9 2.2,10 18,11 45,13 21,14 30,16 47,17 20,20 19,21 1,22 3,24 17,25 8,26 1,28 1,29 6,31 1,32 28,35 13.3,36 0.128,37 6,38 42,39 46.211,40 49.996,41 31.472,42 30.712,44 5.222}
{0 CHEMBL584147,1 8.26,2 45.8,3 41.7,4 1.011,5 1.107,6 0.699,7 0.667,8 396.49,10 18,11 48,13 21,14 30,16 50,17 22,20 19,21 3,22 3,24 20,25 6,26 1,29 5,31 1,32 28,35 10.4,36 0.12,37 6,38 42,39 48.549,40 53.119,41 33.534,42 32.029,44 5.959}
{0 CHEMBL584365,1 8.457,2 44.7,3 40.4,4 1.016,5 1.111,6 0.697,7 0.671,8 397.48,9 2.1,10 18,11 47,13 21,14 30,16 49,17 21,20 19,21 2,22 3,24 19,25 7,26 1,28 1,29 5,31 1,32 28,35 10.6,36 0.122,37 6,38 42,39 47.767,40 52.202,41 32.779,42 31.524,44 6.886}
{0 CHEMBL585376,1 8.753,2 42.9,3 40,4 1.026,5 1.111,6 0.693,7 0.67,8 306.36,10 12,11 35,13 15,14 22,16 36,17 15,20 13,21 2,22 3,24 14,25 6,26 1,29 5,31 1,32 21,35 14.3,36 0.139,37 5,38 31,39 35.898,40 38.873,41 24.25,42 23.449,44 4.032}
{0 CHEMBL603656,1 7.802,2 39.7,3 43.1,4 1.016,5 1.14,6 0.654,7 0.637,8 452.54,9 10.3,10 17,11 58,13 19,14 36,16 61,17 23,20 14,21 9,22 2,23 1,24 25,25 10,28 6,29 3,32 33,34 1,35 5.2,36 0.115,37 7,38 46.5,39 58.941,40 66.11,41 37.949,42 36.924,43 1.7,44 4.602}
{0 CHEMBL88520,1 6.905,2 34.3,3 50.7,4 1.009,5 1.141,6 0.614,7 0.586,8 462.61,9 6,10 6,11 67,13 10,14 34,16 68,17 23,20 10,21 13,22 4,24 34,25 10,28 4,29 6,32 33,35 9,36 0.088,37 6,38 41,39 67.625,40 76.478,41 41.171,42 39.276,44 7.456}
{0 CHEMBL91636,1 6.765,2 30.8,3 52.6,4 1.013,5 1.149,6 0.594,7 0.568,8 527.7,9 6.4,11 78,13 5,14 38,16 79,17 24,20 5,21 19,22 5,24 41,25 13,28 5,29 8,32 37,35 10.3,36 0.076,37 6,38 43,39 79.032,40 89.64,41 46.37,42 44.308,44 6.971}
