"molecule_id","AMW","C.","H.","Me","Mi","Mp","Mv","MW","N.","nAB","nAT","nB","nBM","nBO","nBR","nBT","nC","nCL","nCsp","nCsp2","nCsp3","nDB","nF","nH","nHet","nHM","nI","nN","nO","nP","nS","nSK","nTB","nX","O.","RBF","RBN","SCBO","Se","Si","Sp","Sv","X.","pXC50"
{1 7.745,2 26.3,3 47.4,4 1.05,5 1.158,6 0.572,7 0.578,8 147.15,9 5.3,11 19,13 2,14 9,16 18,17 5,20 2,21 3,22 2,24 9,25 5,28 1,29 4,32 10,35 21.1,36 0.167,37 3,38 11,39 19.945,40 21.997,41 10.869,42 10.988,44 4.854}
{0 CHEMBL1215450,1 6.317,2 28.2,3 56.4,4 1.009,5 1.153,6 0.575,7 0.543,8 246.35,9 5.1,11 39,13 2,14 16,16 38,17 11,20 2,21 9,22 2,24 22,25 6,28 2,29 4,32 17,35 10.3,36 0.237,37 9,38 18,39 39.349,40 44.986,41 22.443,42 21.17,44 4.77}
{0 CHEMBL1215451,1 6.2,2 28.6,3 57.1,4 1.006,5 1.152,6 0.576,7 0.54,8 260.38,9 4.8,11 42,13 2,14 17,16 41,17 12,20 2,21 10,22 2,24 24,25 6,28 2,29 4,32 18,35 9.5,36 0.244,37 10,38 19,39 42.232,40 48.401,41 24.205,42 22.697,44 5.06}
{0 CHEMBL1215518,1 6.098,2 28.9,3 57.8,4 1.003,5 1.151,6 0.577,7 0.538,8 274.41,9 4.4,11 45,13 2,14 18,16 44,17 13,20 2,21 11,22 2,24 26,25 6,28 2,29 4,32 19,35 8.9,36 0.25,37 11,38 20,39 45.116,40 51.817,41 25.966,42 24.224,44 5.222}
{0 CHEMBL1215519,1 6.009,2 29.2,3 58.3,4 1,5 1.151,6 0.578,7 0.536,8 288.44,9 4.2,11 48,13 2,14 19,16 47,17 14,20 2,21 12,22 2,24 28,25 6,28 2,29 4,32 20,35 8.3,36 0.255,37 12,38 21,39 48,40 55.232,41 27.728,42 25.75,44 5.523}
{0 CHEMBL1215520,1 5.931,2 29.4,3 58.8,4 0.998,5 1.15,6 0.578,7 0.535,8 302.47,9 3.9,11 51,13 2,14 20,16 50,17 15,20 2,21 13,22 2,24 30,25 6,28 2,29 4,32 21,35 7.8,36 0.26,37 13,38 22,39 50.883,40 58.647,41 29.489,42 27.277,44 5.26}
{0 CHEMBL1215521,1 5.861,2 29.6,3 59.3,4 0.996,5 1.149,6 0.579,7 0.533,8 316.5,9 3.7,11 54,13 2,14 21,16 53,17 16,20 2,21 14,22 2,24 32,25 6,28 2,29 4,32 22,35 7.4,36 0.264,37 14,38 23,39 53.767,40 62.062,41 31.25,42 28.804,44 4.959}
{0 CHEMBL1215522,1 5.799,2 29.8,3 59.6,4 0.994,5 1.149,6 0.579,7 0.532,8 330.53,9 3.5,11 57,13 2,14 22,16 56,17 17,20 2,21 15,22 2,24 34,25 6,28 2,29 4,32 23,35 7,36 0.268,37 15,38 24,39 56.65,40 65.477,41 33.012,42 30.331,44 4.658}
{0 CHEMBL1215587,1 6.009,2 29.2,3 58.3,4 1,5 1.151,6 0.578,7 0.536,8 288.44,9 4.2,11 48,13 2,14 19,16 47,17 14,20 2,21 12,22 2,24 28,25 6,28 2,29 4,32 20,35 8.3,36 0.255,37 12,38 21,39 48,40 55.232,41 27.728,42 25.75,44 5.092}
{0 CHEMBL1215588,1 5.799,2 29.8,3 59.6,4 0.994,5 1.149,6 0.579,7 0.532,8 330.53,9 3.5,11 57,13 2,14 22,16 56,17 17,20 2,21 15,22 2,24 34,25 6,28 2,29 4,32 23,35 7,36 0.268,37 15,38 24,39 56.65,40 65.477,41 33.012,42 30.331,44 5.495}
{0 CHEMBL1215589,1 6.285,2 34.5,3 55.2,4 0.996,5 1.139,6 0.608,7 0.566,8 364.54,9 3.4,10 6,11 58,13 8,14 26,16 58,17 20,20 8,21 12,22 2,24 32,25 6,28 2,29 4,32 26,35 6.9,36 0.241,37 14,38 31,39 57.767,40 66.062,41 35.25,42 32.804,44 5.699}
{0 CHEMBL1215590,1 6.098,2 28.9,3 57.8,4 1.003,5 1.151,6 0.577,7 0.538,8 274.41,9 4.4,11 45,13 2,14 18,16 44,17 13,20 2,21 11,22 2,24 26,25 6,28 2,29 4,32 19,35 8.9,36 0.273,37 12,38 20,39 45.116,40 51.817,41 25.966,42 24.224,44 5.357}
{0 CHEMBL1229308,1 6.009,2 29.2,3 58.3,4 1,5 1.151,6 0.578,7 0.536,8 288.44,9 4.2,11 48,13 2,14 19,16 47,17 14,20 2,21 12,22 2,24 28,25 6,28 2,29 4,32 20,35 8.3,36 0.255,37 12,38 21,39 48,40 55.232,41 27.728,42 25.75,44 5.523}
{0 CHEMBL1230640,1 9.009,2 47.6,3 33.3,4 1.035,5 1.113,6 0.698,7 0.702,8 189.18,9 4.8,10 11,11 21,13 12,14 15,16 22,17 10,20 10,22 1,24 7,25 4,28 1,29 3,32 14,35 14.3,36 0.045,37 1,38 21.5,39 21.735,40 23.372,41 14.653,42 14.746,44 5.77}
{0 CHEMBL1435274,1 9.009,2 47.6,3 33.3,4 1.035,5 1.113,6 0.698,7 0.702,8 189.18,9 4.8,10 11,11 21,13 12,14 15,16 22,17 10,20 10,22 1,24 7,25 4,28 1,29 3,32 14,35 14.3,36 0.045,37 1,38 21.5,39 21.735,40 23.372,41 14.653,42 14.746,44 5.77}
{0 CHEMBL1614745,1 8.229,2 27.8,3 44.4,4 1.065,5 1.15,6 0.573,7 0.593,8 148.13,11 18,13 2,14 9,16 17,17 5,20 2,21 3,22 2,24 8,25 5,29 5,32 10,35 27.8,36 0.235,37 4,38 11,39 19.171,40 20.708,41 10.318,42 10.681,44 4.62}
{0 CHEMBL1615211,1 8.229,2 27.8,3 44.4,4 1.065,5 1.15,6 0.573,7 0.593,8 148.13,11 18,13 2,14 9,16 17,17 5,20 2,21 3,22 2,24 8,25 5,29 5,32 10,35 27.8,36 0.235,37 4,38 11,39 19.171,40 20.708,41 10.318,42 10.681,44 4.585}
{0 CHEMBL1938900,1 7.563,2 41.5,3 44.6,4 1.012,5 1.125,6 0.656,7 0.634,8 491.59,9 4.6,10 17,11 65,13 21,14 38,16 67,17 27,20 21,21 6,22 4,24 29,25 9,28 3,29 6,32 36,35 9.2,36 0.194,37 13,38 50.5,39 65.756,40 73.149,41 42.642,42 41.201,44 5.367}
{0 CHEMBL316034,1 9.831,2 41.2,3 29.4,4 1.069,5 1.127,6 0.667,7 0.702,8 167.13,9 5.9,10 6,11 17,13 8,14 12,16 17,17 7,20 7,22 2,24 5,25 5,28 1,29 4,32 12,35 23.5,36 0.118,37 2,38 17,39 18.178,40 19.166,41 11.346,42 11.934,44 5.377}
{0 CHEMBL583959,1 9.142,2 31.3,3 50,4 0.99,5 1.112,6 0.748,7 0.64,8 292.56,9 6.3,11 32,13 2,14 17,16 33,17 10,20 2,21 8,22 2,24 16,25 6,26 4,28 2,31 4,32 16,36 0.091,37 3,38 19,39 31.694,40 35.583,41 23.932,42 20.479,44 5.481}
{0 CHEMBL591689,1 8.175,2 42.9,3 40.5,4 1.027,5 1.121,6 0.662,7 0.655,8 343.36,9 2.4,10 12,11 42,13 15,14 26,16 43,17 18,20 15,21 3,22 3,24 17,25 7,28 1,29 6,32 25,35 14.3,36 0.186,37 8,38 35,39 43.134,40 47.076,41 27.824,42 27.525,44 4.481}
{0 CHEMBL591925,1 8.604,2 42.9,3 38.1,4 1.039,5 1.129,6 0.661,7 0.664,8 361.35,9 2.4,10 12,11 42,13 15,14 27,16 43,17 18,20 15,21 3,22 3,23 1,24 16,25 8,28 1,29 6,32 26,34 1,35 14.3,36 0.186,37 8,38 36,39 43.647,40 47.416,41 27.761,42 27.908,43 2.4,44 5}
{0 CHEMBL599994,1 7.866,2 41.1,3 42.9,4 1.022,5 1.126,6 0.653,7 0.64,8 440.49,9 3.6,10 12,11 56,13 16,14 34,16 58,17 23,20 16,21 7,22 4,24 24,25 9,28 2,29 7,32 32,35 12.5,36 0.172,37 10,38 44,39 57.214,40 63.03,41 36.568,42 35.841,44 4.886}
{0 CHEMBL600221,1 8.324,2 38.9,3 42.6,4 1.028,5 1.123,6 0.66,7 0.643,8 449.52,9 1.9,10 12,11 54,13 17,14 32,16 55,17 21,20 15,21 6,22 5,24 23,25 10,26 1,28 1,29 8,31 1,32 31,35 14.8,36 0.164,37 9,38 43,39 55.516,40 60.661,41 35.665,42 34.722,44 4.886}
{0 CHEMBL602295,1 9.367,2 40.5,3 35.7,4 1.047,5 1.119,6 0.681,7 0.681,8 393.4,9 2.4,10 12,11 42,13 17,14 28,16 43,17 17,20 15,21 2,22 5,24 15,25 10,26 1,28 1,29 8,31 1,32 27,35 19,36 0.186,37 8,38 39,39 43.982,40 47,41 28.619,42 28.615,44 4.854}
{0 CHEMBL602502,1 9.795,2 40.5,3 33.3,4 1.059,5 1.127,6 0.68,7 0.69,8 411.39,9 2.4,10 12,11 42,13 17,14 29,16 43,17 17,20 15,21 2,22 5,23 1,24 14,25 11,26 1,28 1,29 8,31 1,32 28,34 1,35 19,36 0.186,37 8,38 40,39 44.495,40 47.34,41 28.557,42 28.998,43 2.4,44 4.699}
{0 CHEMBL602503,1 11.245,2 40.5,3 33.3,4 1.053,5 1.115,6 0.714,7 0.706,8 472.29,9 2.4,10 12,11 42,13 17,14 29,15 1,16 43,17 17,20 15,21 2,22 5,24 14,25 11,26 2,28 1,29 8,31 1,32 28,34 1,35 19,36 0.186,37 8,38 40,39 44.211,40 46.842,41 29.972,42 29.64,43 2.4,44 4.921}
{0 CHEMBL602673,1 8.826,2 40.9,3 36.4,4 1.046,5 1.127,6 0.659,7 0.669,8 388.36,9 4.5,10 12,11 44,13 17,14 29,16 45,17 18,20 15,21 3,22 5,24 16,25 10,28 2,29 8,32 28,35 18.2,36 0.2,37 9,38 40,39 46.007,40 49.578,41 28.977,42 29.449,44 4.77}
