"molecule_id","FCFP4_1024b1","FCFP4_1024b10","FCFP4_1024b100","FCFP4_1024b1000","FCFP4_1024b1001","FCFP4_1024b1002","FCFP4_1024b1003","FCFP4_1024b1004","FCFP4_1024b1005","FCFP4_1024b1006","FCFP4_1024b1007","FCFP4_1024b1008","FCFP4_1024b1009","FCFP4_1024b101","FCFP4_1024b1010","FCFP4_1024b1011","FCFP4_1024b1012","FCFP4_1024b1013","FCFP4_1024b1014","FCFP4_1024b1015","FCFP4_1024b1016","FCFP4_1024b1017","FCFP4_1024b1018","FCFP4_1024b1019","FCFP4_1024b102","FCFP4_1024b1020","FCFP4_1024b1021","FCFP4_1024b1022","FCFP4_1024b1023","FCFP4_1024b1024","FCFP4_1024b103","FCFP4_1024b104","FCFP4_1024b105","FCFP4_1024b106","FCFP4_1024b107","FCFP4_1024b108","FCFP4_1024b109","FCFP4_1024b11","FCFP4_1024b110","FCFP4_1024b111","FCFP4_1024b112","FCFP4_1024b113","FCFP4_1024b114","FCFP4_1024b115","FCFP4_1024b116","FCFP4_1024b117","FCFP4_1024b118","FCFP4_1024b119","FCFP4_1024b12","FCFP4_1024b120","FCFP4_1024b121","pXC50"
{1 1,4 1,35 1,50 1,52 5}
{0 CHEMBL1738758,1 1,2 1,23 1,52 5}
{0 CHEMBL1958399,1 1,52 6.638}
{0 CHEMBL1958400,1 1,52 5.921}
{0 CHEMBL1958401,1 1,52 8.699}
{0 CHEMBL1958402,1 1,26 1,52 8.301}
{0 CHEMBL1958403,1 1,4 1,52 7.824}
{0 CHEMBL1958404,1 1,4 1,29 1,52 9.301}
{0 CHEMBL1958405,1 1,52 7.222}
{0 CHEMBL1958406,1 1,52 9.523}
{0 CHEMBL1958407,1 1,45 1,52 8.854}
{0 CHEMBL1958408,1 1,52 9.301}
{0 CHEMBL1958409,1 1,52 8.959}
{0 CHEMBL1958410,1 1,35 1,52 8.268}
{0 CHEMBL1958411,1 1,52 7.824}
{0 CHEMBL1958412,1 1,35 1,52 6.845}
{0 CHEMBL1958413,1 1,52 6.745}
{0 CHEMBL1958414,1 1,52 7.222}
{0 CHEMBL1958415,1 1,52 6.523}
{0 CHEMBL1958416,1 1,52 6.523}
{0 CHEMBL1958417,1 1,2 1,52 5.583}
{0 CHEMBL1958418,1 1,26 1,52 6.387}
{0 CHEMBL1958419,1 1,52 5.75}
{0 CHEMBL1958420,1 1,52 6.523}
{0 CHEMBL1958421,1 1,52 6.484}
{0 CHEMBL2016856,1 1,4 1,52 9}
{0 CHEMBL2016857,1 1,16 1,26 1,52 7.481}
{0 CHEMBL2016858,1 1,16 1,52 8.046}
{0 CHEMBL2016859,1 1,16 1,52 7.481}
{0 CHEMBL2016860,1 1,4 1,25 1,52 6.432}
{0 CHEMBL2016861,1 1,25 1,52 4.602}
{0 CHEMBL2016862,1 1,4 1,25 1,52 9}
{0 CHEMBL2016996,1 1,25 1,52 9}
{0 CHEMBL2016997,1 1,16 1,25 1,36 1,52 4.602}
{0 CHEMBL2016998,1 1,25 1,35 1,52 4.602}
{0 CHEMBL2016999,1 1,16 1,25 1,35 1,52 7.387}
{0 CHEMBL2017000,1 1,16 1,25 1,26 1,52 8.097}
{0 CHEMBL2017001,1 1,25 1,52 5.292}
{0 CHEMBL2017002,1 1,16 1,25 1,52 9}
{0 CHEMBL2017003,1 1,25 1,36 1,52 4.602}
{0 CHEMBL402548,1 1,2 1,3 1,4 1,29 1,35 1,50 1,52 5}
