{
  "data_qualities": {
    "quality": [
      {
        "name": "AutoCorrelation",
        "value": "0.37246341463414634"
      },
      {
        "name": "ClassEntropy",
        "value": []
      },
      {
        "name": "Dimensionality",
        "value": "0.09523809523809523"
      },
      {
        "name": "EquivalentNumberOfAtts",
        "value": []
      },
      {
        "name": "MajorityClassPercentage",
        "value": []
      },
      {
        "name": "MajorityClassSize",
        "value": []
      },
      {
        "name": "MaxAttributeEntropy",
        "value": []
      },
      {
        "name": "MaxKurtosisOfNumericAtts",
        "value": "3.1150043190200924"
      },
      {
        "name": "MaxMeansOfNumericAtts",
        "value": "42.45238095238095"
      },
      {
        "name": "MaxMutualInformation",
        "value": []
      },
      {
        "name": "MaxNominalAttDistinctValues",
        "value": []
      },
      {
        "name": "MaxSkewnessOfNumericAtts",
        "value": "0.2958136502712992"
      },
      {
        "name": "MaxStdDevOfNumericAtts",
        "value": "2.6058319298177337"
      },
      {
        "name": "MeanAttributeEntropy",
        "value": []
      },
      {
        "name": "MeanKurtosisOfNumericAtts",
        "value": "1.535907241318792"
      },
      {
        "name": "MeanMeansOfNumericAtts",
        "value": "25.97588095238095"
      },
      {
        "name": "MeanMutualInformation",
        "value": []
      },
      {
        "name": "MeanNoiseToSignalRatio",
        "value": []
      },
      {
        "name": "MeanNominalAttDistinctValues",
        "value": []
      },
      {
        "name": "MeanSkewnessOfNumericAtts",
        "value": "-0.5662567529144735"
      },
      {
        "name": "MeanStdDevOfNumericAtts",
        "value": "1.6653372139755336"
      },
      {
        "name": "MinAttributeEntropy",
        "value": []
      },
      {
        "name": "MinKurtosisOfNumericAtts",
        "value": "-1.1911124380415266"
      },
      {
        "name": "MinMeansOfNumericAtts",
        "value": "4.880023809523809"
      },
      {
        "name": "MinMutualInformation",
        "value": []
      },
      {
        "name": "MinNominalAttDistinctValues",
        "value": []
      },
      {
        "name": "MinSkewnessOfNumericAtts",
        "value": "-1.5738125585605893"
      },
      {
        "name": "MinStdDevOfNumericAtts",
        "value": "0.7513293743010268"
      },
      {
        "name": "MinorityClassPercentage",
        "value": []
      },
      {
        "name": "MinorityClassSize",
        "value": []
      },
      {
        "name": "NumberOfBinaryFeatures",
        "value": "0.0"
      },
      {
        "name": "NumberOfClasses",
        "value": "0.0"
      },
      {
        "name": "NumberOfFeatures",
        "value": "4.0"
      },
      {
        "name": "NumberOfInstances",
        "value": "42.0"
      },
      {
        "name": "NumberOfInstancesWithMissingValues",
        "value": "0.0"
      },
      {
        "name": "NumberOfMissingValues",
        "value": "0.0"
      },
      {
        "name": "NumberOfNumericFeatures",
        "value": "3.0"
      },
      {
        "name": "NumberOfSymbolicFeatures",
        "value": "1.0"
      },
      {
        "name": "PercentageOfBinaryFeatures",
        "value": "0.0"
      },
      {
        "name": "PercentageOfInstancesWithMissingValues",
        "value": "0.0"
      },
      {
        "name": "PercentageOfMissingValues",
        "value": "0.0"
      },
      {
        "name": "PercentageOfNumericFeatures",
        "value": "75.0"
      },
      {
        "name": "PercentageOfSymbolicFeatures",
        "value": "25.0"
      },
      {
        "name": "Quartile1AttributeEntropy",
        "value": []
      },
      {
        "name": "Quartile1KurtosisOfNumericAtts",
        "value": "-1.1911124380415266"
      },
      {
        "name": "Quartile1MeansOfNumericAtts",
        "value": "4.880023809523809"
      },
      {
        "name": "Quartile1MutualInformation",
        "value": []
      },
      {
        "name": "Quartile1SkewnessOfNumericAtts",
        "value": "-1.5738125585605893"
      },
      {
        "name": "Quartile1StdDevOfNumericAtts",
        "value": "0.7513293743010268"
      },
      {
        "name": "Quartile2AttributeEntropy",
        "value": []
      },
      {
        "name": "Quartile2KurtosisOfNumericAtts",
        "value": "2.68382984297781"
      },
      {
        "name": "Quartile2MeansOfNumericAtts",
        "value": "30.595238095238095"
      },
      {
        "name": "Quartile2MutualInformation",
        "value": []
      },
      {
        "name": "Quartile2SkewnessOfNumericAtts",
        "value": "-0.4207713504541304"
      },
      {
        "name": "Quartile2StdDevOfNumericAtts",
        "value": "1.6388503378078403"
      },
      {
        "name": "Quartile3AttributeEntropy",
        "value": []
      },
      {
        "name": "Quartile3KurtosisOfNumericAtts",
        "value": "3.1150043190200924"
      },
      {
        "name": "Quartile3MeansOfNumericAtts",
        "value": "42.45238095238095"
      },
      {
        "name": "Quartile3MutualInformation",
        "value": []
      },
      {
        "name": "Quartile3SkewnessOfNumericAtts",
        "value": "0.2958136502712992"
      },
      {
        "name": "Quartile3StdDevOfNumericAtts",
        "value": "2.6058319298177337"
      },
      {
        "name": "StdvNominalAttDistinctValues",
        "value": []
      }
    ]
  }
}