{
  "data_set_description": {
    "collection_date": "November 2013",
    "creator": "Dr Jeremy Besnard, Dr Ivan Olier, Dr Noureddin Sadawi, Dr Larisa Soldatova, Dr Crina Grosan, Prof Ross King, Dr Richard Bickerton, Prof Andrew Hopkins and Dr Willem van Hoorn",
    "default_target_attribute": "pXC50",
    "description": "This dataset contains QSAR data (from ChEMBL version 17) showing activity values (unit is pseudo-pCI50) of several compounds on drug target ChEMBL_ID: CHEMBL3593 (TID: 11231), and it has 126 rows and 43 features (not including molecule IDs and class feature: molecule_id and pXC50). The features represent Basic Molecular Descriptors which were generated from SMILES strings.  Missing value imputation was applied to this dataset (By choosing the Median).",
    "description_version": "1",
    "file_id": "3268401",
    "format": "ARFF",
    "id": "25284",
    "licence": "Public",
    "md5_checksum": "63987e5cbfdad45723ff613384913fae",
    "minio_url": "https://data.openml.org/datasets/0002/25284/dataset_25284.pq",
    "name": "QSAR-DATASET-FOR-DRUG-TARGET-CHEMBL3593",
    "original_data_url": "https://www.ebi.ac.uk/chembl/target/inspect/CHEMBL3593",
    "parquet_url": "https://data.openml.org/datasets/0002/25284/dataset_25284.pq",
    "processing_date": "2018-10-03 23:07:19",
    "row_id_attribute": "molecule_id",
    "status": "deactivated",
    "tag": [
      "MetaQSAR",
      "study_13"
    ],
    "upload_date": "2016-07-14T16:34:30",
    "url": "https://api.openml.org/data/v1/download/3268401/QSAR-DATASET-FOR-DRUG-TARGET-CHEMBL3593.arff",
    "version": "8",
    "visibility": "public"
  }
}