{
  "data_set_description": {
    "collection_date": "November 2013",
    "creator": "Dr Jeremy Besnard, Dr Ivan Olier, Dr Noureddin Sadawi, Dr Larisa Soldatova, Dr Crina Grosan, Prof Ross King, Dr Richard Bickerton, Prof Andrew Hopkins and Dr Willem van Hoorn",
    "default_target_attribute": "pXC50",
    "description": "This dataset contains QSAR data (from ChEMBL version 17) showing activity values (unit is pseudo-pCI50) of several compounds on drug target ChEMBL_ID: CHEMBL2334 (TID: 10131), and it has 1979 rows and 1404 features (not including molecule IDs and class feature: molecule_id and pXC50). The features represent Molecular Descriptors which were generated from SMILES strings. Missing value imputation was applied to this dataset (By choosing the Median).",
    "description_version": "1",
    "file_id": "3268391",
    "format": "ARFF",
    "id": "25282",
    "licence": "Public",
    "md5_checksum": "da2fad0e2f90ada4a2dd40f59f0cfd45",
    "minio_url": "https://data.openml.org/datasets/0002/25282/dataset_25282.pq",
    "name": "QSAR-DATASET-FOR-DRUG-TARGET-CHEMBL2334",
    "original_data_url": "https://www.ebi.ac.uk/chembl/target/inspect/CHEMBL2334",
    "parquet_url": "https://data.openml.org/datasets/0002/25282/dataset_25282.pq",
    "processing_date": "2018-10-03 23:07:36",
    "row_id_attribute": "molecule_id",
    "status": "deactivated",
    "tag": [
      "MetaQSAR",
      "study_13"
    ],
    "upload_date": "2016-07-14T16:34:14",
    "url": "https://api.openml.org/data/v1/download/3268391/QSAR-DATASET-FOR-DRUG-TARGET-CHEMBL2334.arff",
    "version": "9",
    "visibility": "public"
  }
}