{
  "data_features": {
    "feature": [
      {
        "data_type": "nominal",
        "index": "0",
        "is_ignore": "false",
        "is_row_identifier": "true",
        "is_target": "false",
        "name": "molecule_id",
        "nominal_value": [
          "CHEMBL100154",
          "CHEMBL100483",
          "CHEMBL1088981",
          "CHEMBL1099309",
          "CHEMBL110971",
          "CHEMBL111593",
          "CHEMBL111695",
          "CHEMBL112840",
          "CHEMBL1160571",
          "CHEMBL1258421",
          "CHEMBL1258422",
          "CHEMBL149321",
          "CHEMBL194557",
          "CHEMBL194624",
          "CHEMBL198510",
          "CHEMBL2048236",
          "CHEMBL2048237",
          "CHEMBL2048238",
          "CHEMBL2048239",
          "CHEMBL2048240",
          "CHEMBL2048241",
          "CHEMBL2048242",
          "CHEMBL2048243",
          "CHEMBL2048244",
          "CHEMBL2048247",
          "CHEMBL2088336",
          "CHEMBL2088337",
          "CHEMBL2088338",
          "CHEMBL2088339",
          "CHEMBL2088342",
          "CHEMBL2088344",
          "CHEMBL2338353",
          "CHEMBL2338354",
          "CHEMBL2338355",
          "CHEMBL2338356",
          "CHEMBL2338357",
          "CHEMBL2338358",
          "CHEMBL2338359",
          "CHEMBL2338360",
          "CHEMBL2338361",
          "CHEMBL2338362",
          "CHEMBL2338363",
          "CHEMBL2338364",
          "CHEMBL2338365",
          "CHEMBL2338366",
          "CHEMBL2338367",
          "CHEMBL2338368",
          "CHEMBL2338369",
          "CHEMBL2338370",
          "CHEMBL2338371",
          "CHEMBL2338372",
          "CHEMBL2338373",
          "CHEMBL2338374",
          "CHEMBL2338375",
          "CHEMBL2338376",
          "CHEMBL2338377",
          "CHEMBL2338378",
          "CHEMBL2338379",
          "CHEMBL2338380",
          "CHEMBL2338381",
          "CHEMBL2338382",
          "CHEMBL2338383",
          "CHEMBL2347862",
          "CHEMBL2347863",
          "CHEMBL235059",
          "CHEMBL235481",
          "CHEMBL235690",
          "CHEMBL237379",
          "CHEMBL237589",
          "CHEMBL237808",
          "CHEMBL238046",
          "CHEMBL240775",
          "CHEMBL255828",
          "CHEMBL256033",
          "CHEMBL256222",
          "CHEMBL256476",
          "CHEMBL257948",
          "CHEMBL258994",
          "CHEMBL259729",
          "CHEMBL260340",
          "CHEMBL260715",
          "CHEMBL261582",
          "CHEMBL269960",
          "CHEMBL271291",
          "CHEMBL271482",
          "CHEMBL271845",
          "CHEMBL272054",
          "CHEMBL272162",
          "CHEMBL272163",
          "CHEMBL272377",
          "CHEMBL272547",
          "CHEMBL272913",
          "CHEMBL272914",
          "CHEMBL277580",
          "CHEMBL280463",
          "CHEMBL288665",
          "CHEMBL291727",
          "CHEMBL291736",
          "CHEMBL292224",
          "CHEMBL293116",
          "CHEMBL293522",
          "CHEMBL294191",
          "CHEMBL294192",
          "CHEMBL294478",
          "CHEMBL298547",
          "CHEMBL298771",
          "CHEMBL298852",
          "CHEMBL299563",
          "CHEMBL299717",
          "CHEMBL299988",
          "CHEMBL301065",
          "CHEMBL301244",
          "CHEMBL301247",
          "CHEMBL316844",
          "CHEMBL317573",
          "CHEMBL319144",
          "CHEMBL322081",
          "CHEMBL322551",
          "CHEMBL324003",
          "CHEMBL340034",
          "CHEMBL34249",
          "CHEMBL371748",
          "CHEMBL372556",
          "CHEMBL392675",
          "CHEMBL392884",
          "CHEMBL394758",
          "CHEMBL394759",
          "CHEMBL397829",
          "CHEMBL398105",
          "CHEMBL403226",
          "CHEMBL404337",
          "CHEMBL40664",
          "CHEMBL406820",
          "CHEMBL408608",
          "CHEMBL412889",
          "CHEMBL41342",
          "CHEMBL414849",
          "CHEMBL416301",
          "CHEMBL417549",
          "CHEMBL417932",
          "CHEMBL431735",
          "CHEMBL434024",
          "CHEMBL437758",
          "CHEMBL446734",
          "CHEMBL452354",
          "CHEMBL457069",
          "CHEMBL457423",
          "CHEMBL457424",
          "CHEMBL494897",
          "CHEMBL504429",
          "CHEMBL52137",
          "CHEMBL52761",
          "CHEMBL53950",
          "CHEMBL54004",
          "CHEMBL54344",
          "CHEMBL54472",
          "CHEMBL54480",
          "CHEMBL54537",
          "CHEMBL54714",
          "CHEMBL54747",
          "CHEMBL54926",
          "CHEMBL55140",
          "CHEMBL55214",
          "CHEMBL55264",
          "CHEMBL55352",
          "CHEMBL55358",
          "CHEMBL55371",
          "CHEMBL55464",
          "CHEMBL55557",
          "CHEMBL55572",
          "CHEMBL55608",
          "CHEMBL55779",
          "CHEMBL55837",
          "CHEMBL55856",
          "CHEMBL55886",
          "CHEMBL55959",
          "CHEMBL56011",
          "CHEMBL56073",
          "CHEMBL56253",
          "CHEMBL56254",
          "CHEMBL56255",
          "CHEMBL56556",
          "CHEMBL58830",
          "CHEMBL834",
          "CHEMBL84909",
          "CHEMBL870",
          "CHEMBL923",
          "CHEMBL924",
          "CHEMBL98110",
          "CHEMBL98719",
          "CHEMBL99369",
          "CHEMBL99553",
          "CHEMBL997"
        ],
        "number_of_missing_values": "0"
      },
      {
        "data_type": "numeric",
        "index": "1",
        "is_ignore": "false",
        "is_row_identifier": "false",
        "is_target": "false",
        "name": "AMW",
        "number_of_missing_values": "0"
      },
      {
        "data_type": "numeric",
        "index": "2",
        "is_ignore": "false",
        "is_row_identifier": "false",
        "is_target": "false",
        "name": "C.",
        "number_of_missing_values": "0"
      },
      {
        "data_type": "numeric",
        "index": "3",
        "is_ignore": "false",
        "is_row_identifier": "false",
        "is_target": "false",
        "name": "H.",
        "number_of_missing_values": "0"
      },
      {
        "data_type": "numeric",
        "index": "4",
        "is_ignore": "false",
        "is_row_identifier": "false",
        "is_target": "false",
        "name": "Me",
        "number_of_missing_values": "0"
      },
      {
        "data_type": "numeric",
        "index": "5",
        "is_ignore": "false",
        "is_row_identifier": "false",
        "is_target": "false",
        "name": "Mi",
        "number_of_missing_values": "0"
      },
      {
        "data_type": "numeric",
        "index": "6",
        "is_ignore": "false",
        "is_row_identifier": "false",
        "is_target": "false",
        "name": "Mp",
        "number_of_missing_values": "0"
      },
      {
        "data_type": "numeric",
        "index": "7",
        "is_ignore": "false",
        "is_row_identifier": "false",
        "is_target": "false",
        "name": "Mv",
        "number_of_missing_values": "0"
      },
      {
        "data_type": "numeric",
        "index": "8",
        "is_ignore": "false",
        "is_row_identifier": "false",
        "is_target": "false",
        "name": "MW",
        "number_of_missing_values": "0"
      },
      {
        "data_type": "numeric",
        "index": "9",
        "is_ignore": "false",
        "is_row_identifier": "false",
        "is_target": "false",
        "name": "N.",
        "number_of_missing_values": "0"
      },
      {
        "data_type": "numeric",
        "index": "10",
        "is_ignore": "false",
        "is_row_identifier": "false",
        "is_target": "false",
        "name": "nAB",
        "number_of_missing_values": "0"
      },
      {
        "data_type": "numeric",
        "index": "11",
        "is_ignore": "false",
        "is_row_identifier": "false",
        "is_target": "false",
        "name": "nAT",
        "number_of_missing_values": "0"
      },
      {
        "data_type": "numeric",
        "index": "12",
        "is_ignore": "false",
        "is_row_identifier": "false",
        "is_target": "false",
        "name": "nB",
        "number_of_missing_values": "0"
      },
      {
        "data_type": "numeric",
        "index": "13",
        "is_ignore": "false",
        "is_row_identifier": "false",
        "is_target": "false",
        "name": "nBM",
        "number_of_missing_values": "0"
      },
      {
        "data_type": "numeric",
        "index": "14",
        "is_ignore": "false",
        "is_row_identifier": "false",
        "is_target": "false",
        "name": "nBO",
        "number_of_missing_values": "0"
      },
      {
        "data_type": "numeric",
        "index": "15",
        "is_ignore": "false",
        "is_row_identifier": "false",
        "is_target": "false",
        "name": "nBR",
        "number_of_missing_values": "0"
      },
      {
        "data_type": "numeric",
        "index": "16",
        "is_ignore": "false",
        "is_row_identifier": "false",
        "is_target": "false",
        "name": "nBT",
        "number_of_missing_values": "0"
      },
      {
        "data_type": "numeric",
        "index": "17",
        "is_ignore": "false",
        "is_row_identifier": "false",
        "is_target": "false",
        "name": "nC",
        "number_of_missing_values": "0"
      },
      {
        "data_type": "numeric",
        "index": "18",
        "is_ignore": "false",
        "is_row_identifier": "false",
        "is_target": "false",
        "name": "nCL",
        "number_of_missing_values": "0"
      },
      {
        "data_type": "numeric",
        "index": "19",
        "is_ignore": "false",
        "is_row_identifier": "false",
        "is_target": "false",
        "name": "nCsp",
        "number_of_missing_values": "0"
      },
      {
        "data_type": "numeric",
        "index": "20",
        "is_ignore": "false",
        "is_row_identifier": "false",
        "is_target": "false",
        "name": "nCsp2",
        "number_of_missing_values": "0"
      },
      {
        "data_type": "numeric",
        "index": "21",
        "is_ignore": "false",
        "is_row_identifier": "false",
        "is_target": "false",
        "name": "nCsp3",
        "number_of_missing_values": "0"
      },
      {
        "data_type": "numeric",
        "index": "22",
        "is_ignore": "false",
        "is_row_identifier": "false",
        "is_target": "false",
        "name": "nDB",
        "number_of_missing_values": "0"
      },
      {
        "data_type": "numeric",
        "index": "23",
        "is_ignore": "false",
        "is_row_identifier": "false",
        "is_target": "false",
        "name": "nF",
        "number_of_missing_values": "0"
      },
      {
        "data_type": "numeric",
        "index": "24",
        "is_ignore": "false",
        "is_row_identifier": "false",
        "is_target": "false",
        "name": "nH",
        "number_of_missing_values": "0"
      },
      {
        "data_type": "numeric",
        "index": "25",
        "is_ignore": "false",
        "is_row_identifier": "false",
        "is_target": "false",
        "name": "nHet",
        "number_of_missing_values": "0"
      },
      {
        "data_type": "numeric",
        "index": "26",
        "is_ignore": "false",
        "is_row_identifier": "false",
        "is_target": "false",
        "name": "nHM",
        "number_of_missing_values": "0"
      },
      {
        "data_type": "numeric",
        "index": "27",
        "is_ignore": "false",
        "is_row_identifier": "false",
        "is_target": "false",
        "name": "nI",
        "number_of_missing_values": "0"
      },
      {
        "data_type": "numeric",
        "index": "28",
        "is_ignore": "false",
        "is_row_identifier": "false",
        "is_target": "false",
        "name": "nN",
        "number_of_missing_values": "0"
      },
      {
        "data_type": "numeric",
        "index": "29",
        "is_ignore": "false",
        "is_row_identifier": "false",
        "is_target": "false",
        "name": "nO",
        "number_of_missing_values": "0"
      },
      {
        "data_type": "numeric",
        "index": "30",
        "is_ignore": "false",
        "is_row_identifier": "false",
        "is_target": "false",
        "name": "nP",
        "number_of_missing_values": "0"
      },
      {
        "data_type": "numeric",
        "index": "31",
        "is_ignore": "false",
        "is_row_identifier": "false",
        "is_target": "false",
        "name": "nS",
        "number_of_missing_values": "0"
      },
      {
        "data_type": "numeric",
        "index": "32",
        "is_ignore": "false",
        "is_row_identifier": "false",
        "is_target": "false",
        "name": "nSK",
        "number_of_missing_values": "0"
      },
      {
        "data_type": "numeric",
        "index": "33",
        "is_ignore": "false",
        "is_row_identifier": "false",
        "is_target": "false",
        "name": "nTB",
        "number_of_missing_values": "0"
      },
      {
        "data_type": "numeric",
        "index": "34",
        "is_ignore": "false",
        "is_row_identifier": "false",
        "is_target": "false",
        "name": "nX",
        "number_of_missing_values": "0"
      },
      {
        "data_type": "numeric",
        "index": "35",
        "is_ignore": "false",
        "is_row_identifier": "false",
        "is_target": "false",
        "name": "O.",
        "number_of_missing_values": "0"
      },
      {
        "data_type": "numeric",
        "index": "36",
        "is_ignore": "false",
        "is_row_identifier": "false",
        "is_target": "false",
        "name": "RBF",
        "number_of_missing_values": "0"
      },
      {
        "data_type": "numeric",
        "index": "37",
        "is_ignore": "false",
        "is_row_identifier": "false",
        "is_target": "false",
        "name": "RBN",
        "number_of_missing_values": "0"
      },
      {
        "data_type": "numeric",
        "index": "38",
        "is_ignore": "false",
        "is_row_identifier": "false",
        "is_target": "false",
        "name": "SCBO",
        "number_of_missing_values": "0"
      },
      {
        "data_type": "numeric",
        "index": "39",
        "is_ignore": "false",
        "is_row_identifier": "false",
        "is_target": "false",
        "name": "Se",
        "number_of_missing_values": "0"
      },
      {
        "data_type": "numeric",
        "index": "40",
        "is_ignore": "false",
        "is_row_identifier": "false",
        "is_target": "false",
        "name": "Si",
        "number_of_missing_values": "0"
      },
      {
        "data_type": "numeric",
        "index": "41",
        "is_ignore": "false",
        "is_row_identifier": "false",
        "is_target": "false",
        "name": "Sp",
        "number_of_missing_values": "0"
      },
      {
        "data_type": "numeric",
        "index": "42",
        "is_ignore": "false",
        "is_row_identifier": "false",
        "is_target": "false",
        "name": "Sv",
        "number_of_missing_values": "0"
      },
      {
        "data_type": "numeric",
        "index": "43",
        "is_ignore": "false",
        "is_row_identifier": "false",
        "is_target": "false",
        "name": "X.",
        "number_of_missing_values": "0"
      },
      {
        "data_type": "numeric",
        "index": "44",
        "is_ignore": "false",
        "is_row_identifier": "false",
        "is_target": "true",
        "name": "pXC50",
        "number_of_missing_values": "0"
      }
    ]
  }
}