"molecule_id","H.","AMW","pXC50"
{1 52.4,2 6.787,3 6.726}
{0 CHEMBL499438,1 51.7,2 6.848,3 6.188}
{0 CHEMBL500184,1 51.9,2 6.809,3 6.094}
{0 CHEMBL502642,1 53.1,2 6.69,3 6.635}
{0 CHEMBL503520,1 51.5,2 6.859,3 6.364}
{0 CHEMBL525748,1 53.7,2 6.592,3 6.308}
{0 CHEMBL566340,1 50.5,2 6.858,3 8.796}
{0 CHEMBL568067,1 52.9,2 6.596,3 6.762}
{0 CHEMBL568525,1 54.9,2 6.328,3 8.201}
{0 CHEMBL569280,1 53,2 6.6,3 7.071}
{0 CHEMBL569918,1 51.7,2 6.774,3 8.444}
