{
  "data_qualities": {
    "quality": [
      {
        "name": "AutoCorrelation",
        "value": "0.09985409985409985"
      },
      {
        "name": "CfsSubsetEval_DecisionStumpAUC",
        "value": "0.9221560708590045"
      },
      {
        "name": "CfsSubsetEval_DecisionStumpErrRate",
        "value": "0.132686"
      },
      {
        "name": "CfsSubsetEval_DecisionStumpKappa",
        "value": "0.8525710710073302"
      },
      {
        "name": "CfsSubsetEval_NaiveBayesAUC",
        "value": "0.9221560708590045"
      },
      {
        "name": "CfsSubsetEval_NaiveBayesErrRate",
        "value": "0.132686"
      },
      {
        "name": "CfsSubsetEval_NaiveBayesKappa",
        "value": "0.8525710710073302"
      },
      {
        "name": "CfsSubsetEval_kNN1NAUC",
        "value": "0.9221560708590045"
      },
      {
        "name": "CfsSubsetEval_kNN1NErrRate",
        "value": "0.132686"
      },
      {
        "name": "CfsSubsetEval_kNN1NKappa",
        "value": "0.8525710710073302"
      },
      {
        "name": "ClassEntropy",
        "value": "3.3219223477409177"
      },
      {
        "name": "DecisionStumpAUC",
        "value": "0.6858164951551201"
      },
      {
        "name": "DecisionStumpErrRate",
        "value": "0.807183"
      },
      {
        "name": "DecisionStumpKappa",
        "value": "0.10296548157390899"
      },
      {
        "name": "Dimensionality",
        "value": "6.5E-5"
      },
      {
        "name": "EquivalentNumberOfAtts",
        "value": []
      },
      {
        "name": "J48.00001.AUC",
        "value": "0.9221560708590045"
      },
      {
        "name": "J48.00001.ErrRate",
        "value": "0.132686"
      },
      {
        "name": "J48.00001.Kappa",
        "value": "0.8525710710073302"
      },
      {
        "name": "J48.0001.AUC",
        "value": "0.9221560708590045"
      },
      {
        "name": "J48.0001.ErrRate",
        "value": "0.132686"
      },
      {
        "name": "J48.0001.Kappa",
        "value": "0.8525710710073302"
      },
      {
        "name": "J48.001.AUC",
        "value": "0.9221560708590045"
      },
      {
        "name": "J48.001.ErrRate",
        "value": "0.132686"
      },
      {
        "name": "J48.001.Kappa",
        "value": "0.8525710710073302"
      },
      {
        "name": "MajorityClassPercentage",
        "value": "10.041"
      },
      {
        "name": "MajorityClassSize",
        "value": "100410.0"
      },
      {
        "name": "MaxAttributeEntropy",
        "value": []
      },
      {
        "name": "MaxKurtosisOfNumericAtts",
        "value": "-0.023005420769377505"
      },
      {
        "name": "MaxMeansOfNumericAtts",
        "value": "2.904459029303"
      },
      {
        "name": "MaxMutualInformation",
        "value": []
      },
      {
        "name": "MaxNominalAttDistinctValues",
        "value": "10.0"
      },
      {
        "name": "MaxSkewnessOfNumericAtts",
        "value": "0.39525709849562934"
      },
      {
        "name": "MaxStdDevOfNumericAtts",
        "value": "7.696659431705703"
      },
      {
        "name": "MeanAttributeEntropy",
        "value": []
      },
      {
        "name": "MeanKurtosisOfNumericAtts",
        "value": "-0.3456580793854784"
      },
      {
        "name": "MeanMeansOfNumericAtts",
        "value": "0.05128392965956254"
      },
      {
        "name": "MeanMutualInformation",
        "value": []
      },
      {
        "name": "MeanNoiseToSignalRatio",
        "value": []
      },
      {
        "name": "MeanNominalAttDistinctValues",
        "value": "10.0"
      },
      {
        "name": "MeanSkewnessOfNumericAtts",
        "value": "-0.002548743720673546"
      },
      {
        "name": "MeanStdDevOfNumericAtts",
        "value": "2.151757889973612"
      },
      {
        "name": "MinAttributeEntropy",
        "value": []
      },
      {
        "name": "MinKurtosisOfNumericAtts",
        "value": "-0.9574906478974117"
      },
      {
        "name": "MinMeansOfNumericAtts",
        "value": "-1.827956301127"
      },
      {
        "name": "MinMutualInformation",
        "value": []
      },
      {
        "name": "MinNominalAttDistinctValues",
        "value": "10.0"
      },
      {
        "name": "MinSkewnessOfNumericAtts",
        "value": "-0.3269857180072106"
      },
      {
        "name": "MinStdDevOfNumericAtts",
        "value": "0.89247835712311"
      },
      {
        "name": "MinorityClassPercentage",
        "value": "9.9545"
      },
      {
        "name": "MinorityClassSize",
        "value": "99545.0"
      },
      {
        "name": "NaiveBayesAUC",
        "value": "0.9992931774596041"
      },
      {
        "name": "NaiveBayesErrRate",
        "value": "0.029341"
      },
      {
        "name": "NaiveBayesKappa",
        "value": "0.9673988679458493"
      },
      {
        "name": "NumberOfBinaryFeatures",
        "value": "0.0"
      },
      {
        "name": "NumberOfClasses",
        "value": "10.0"
      },
      {
        "name": "NumberOfFeatures",
        "value": "65.0"
      },
      {
        "name": "NumberOfInstances",
        "value": "1000000.0"
      },
      {
        "name": "NumberOfInstancesWithMissingValues",
        "value": "0.0"
      },
      {
        "name": "NumberOfMissingValues",
        "value": "0.0"
      },
      {
        "name": "NumberOfNumericFeatures",
        "value": "64.0"
      },
      {
        "name": "NumberOfSymbolicFeatures",
        "value": "1.0"
      },
      {
        "name": "PercentageOfBinaryFeatures",
        "value": "0.0"
      },
      {
        "name": "PercentageOfInstancesWithMissingValues",
        "value": "0.0"
      },
      {
        "name": "PercentageOfMissingValues",
        "value": "0.0"
      },
      {
        "name": "PercentageOfNumericFeatures",
        "value": "98.46153846153847"
      },
      {
        "name": "PercentageOfSymbolicFeatures",
        "value": "1.5384615384615385"
      },
      {
        "name": "Quartile1AttributeEntropy",
        "value": []
      },
      {
        "name": "Quartile1KurtosisOfNumericAtts",
        "value": "-0.40837482871198905"
      },
      {
        "name": "Quartile1MeansOfNumericAtts",
        "value": "-0.29703777161024997"
      },
      {
        "name": "Quartile1MutualInformation",
        "value": []
      },
      {
        "name": "Quartile1SkewnessOfNumericAtts",
        "value": "-0.0968244044914378"
      },
      {
        "name": "Quartile1StdDevOfNumericAtts",
        "value": "1.143000667656857"
      },
      {
        "name": "Quartile2AttributeEntropy",
        "value": []
      },
      {
        "name": "Quartile2KurtosisOfNumericAtts",
        "value": "-0.32682670247223156"
      },
      {
        "name": "Quartile2MeansOfNumericAtts",
        "value": "0.005568725506999966"
      },
      {
        "name": "Quartile2MutualInformation",
        "value": []
      },
      {
        "name": "Quartile2SkewnessOfNumericAtts",
        "value": "-0.022362978787213238"
      },
      {
        "name": "Quartile2StdDevOfNumericAtts",
        "value": "1.6487574639793596"
      },
      {
        "name": "Quartile3AttributeEntropy",
        "value": []
      },
      {
        "name": "Quartile3KurtosisOfNumericAtts",
        "value": "-0.2754055581813766"
      },
      {
        "name": "Quartile3MeansOfNumericAtts",
        "value": "0.32188943966600003"
      },
      {
        "name": "Quartile3MutualInformation",
        "value": []
      },
      {
        "name": "Quartile3SkewnessOfNumericAtts",
        "value": "0.046727716827502624"
      },
      {
        "name": "Quartile3StdDevOfNumericAtts",
        "value": "2.6590496710743725"
      },
      {
        "name": "REPTreeDepth1AUC",
        "value": "0.9716253582409665"
      },
      {
        "name": "REPTreeDepth1ErrRate",
        "value": "0.12548"
      },
      {
        "name": "REPTreeDepth1Kappa",
        "value": "0.8605775756400487"
      },
      {
        "name": "REPTreeDepth2AUC",
        "value": "0.9716253582409665"
      },
      {
        "name": "REPTreeDepth2ErrRate",
        "value": "0.12548"
      },
      {
        "name": "REPTreeDepth2Kappa",
        "value": "0.8605775756400487"
      },
      {
        "name": "REPTreeDepth3AUC",
        "value": "0.9716253582409665"
      },
      {
        "name": "REPTreeDepth3ErrRate",
        "value": "0.12548"
      },
      {
        "name": "REPTreeDepth3Kappa",
        "value": "0.8605775756400487"
      },
      {
        "name": "RandomTreeDepth1AUC",
        "value": "0.8938452902320996"
      },
      {
        "name": "RandomTreeDepth1ErrRate",
        "value": "0.191077"
      },
      {
        "name": "RandomTreeDepth1Kappa",
        "value": "0.7876920355702598"
      },
      {
        "name": "RandomTreeDepth2AUC",
        "value": "0.8938452902320996"
      },
      {
        "name": "RandomTreeDepth2ErrRate",
        "value": "0.191077"
      },
      {
        "name": "RandomTreeDepth2Kappa",
        "value": "0.7876920355702598"
      },
      {
        "name": "RandomTreeDepth3AUC",
        "value": "0.8938452902320996"
      },
      {
        "name": "RandomTreeDepth3ErrRate",
        "value": "0.191077"
      },
      {
        "name": "RandomTreeDepth3Kappa",
        "value": "0.7876920355702598"
      },
      {
        "name": "StdvNominalAttDistinctValues",
        "value": "0.0"
      },
      {
        "name": "kNN1NAUC",
        "value": "0.9580815682369408"
      },
      {
        "name": "kNN1NErrRate",
        "value": "0.07545"
      },
      {
        "name": "kNN1NKappa",
        "value": "0.9161661892061942"
      }
    ]
  }
}