{
  "data_features": {
    "feature": [
      {
        "data_type": "nominal",
        "index": "0",
        "is_ignore": "false",
        "is_row_identifier": "true",
        "is_target": "false",
        "name": "molecule_id",
        "nominal_value": [
          "CHEMBL100162",
          "CHEMBL1080298",
          "CHEMBL1081469",
          "CHEMBL1082723",
          "CHEMBL1196581",
          "CHEMBL1200840",
          "CHEMBL1201049",
          "CHEMBL1209347",
          "CHEMBL1210154",
          "CHEMBL121636",
          "CHEMBL121799",
          "CHEMBL122841",
          "CHEMBL123410",
          "CHEMBL123413",
          "CHEMBL124343",
          "CHEMBL127282",
          "CHEMBL1278088",
          "CHEMBL1287814",
          "CHEMBL1287870",
          "CHEMBL1287898",
          "CHEMBL1287899",
          "CHEMBL1287953",
          "CHEMBL1287954",
          "CHEMBL1287984",
          "CHEMBL1287985",
          "CHEMBL1288015",
          "CHEMBL1288016",
          "CHEMBL1288048",
          "CHEMBL1288049",
          "CHEMBL1288077",
          "CHEMBL1288078",
          "CHEMBL1288108",
          "CHEMBL1288138",
          "CHEMBL1288139",
          "CHEMBL1288169",
          "CHEMBL1288170",
          "CHEMBL1288199",
          "CHEMBL1288200",
          "CHEMBL1288226",
          "CHEMBL1288227",
          "CHEMBL1288256",
          "CHEMBL1288257",
          "CHEMBL1288284",
          "CHEMBL1288285",
          "CHEMBL1299267",
          "CHEMBL1300782",
          "CHEMBL1301994",
          "CHEMBL1302519",
          "CHEMBL1303340",
          "CHEMBL1305275",
          "CHEMBL1307319",
          "CHEMBL1307534",
          "CHEMBL1308461",
          "CHEMBL1308845",
          "CHEMBL1309183",
          "CHEMBL1310577",
          "CHEMBL1311570",
          "CHEMBL1311646",
          "CHEMBL1311742",
          "CHEMBL1312220",
          "CHEMBL1312703",
          "CHEMBL1312713",
          "CHEMBL1312767",
          "CHEMBL1319576",
          "CHEMBL1320928",
          "CHEMBL1321571",
          "CHEMBL1322039",
          "CHEMBL1326298",
          "CHEMBL1327690",
          "CHEMBL1328017",
          "CHEMBL1328939",
          "CHEMBL1329027",
          "CHEMBL1329549",
          "CHEMBL1331489",
          "CHEMBL1335124",
          "CHEMBL1335334",
          "CHEMBL1336098",
          "CHEMBL1336318",
          "CHEMBL1337101",
          "CHEMBL1338259",
          "CHEMBL1341841",
          "CHEMBL1342128",
          "CHEMBL1342462",
          "CHEMBL1342624",
          "CHEMBL1342925",
          "CHEMBL1343692",
          "CHEMBL1343796",
          "CHEMBL1343823",
          "CHEMBL1344663",
          "CHEMBL1345141",
          "CHEMBL1345334",
          "CHEMBL1346316",
          "CHEMBL1348298",
          "CHEMBL1348426",
          "CHEMBL1349920",
          "CHEMBL1350193",
          "CHEMBL1350415",
          "CHEMBL1351633",
          "CHEMBL1352348",
          "CHEMBL1353075",
          "CHEMBL1353428",
          "CHEMBL1359108",
          "CHEMBL1359694",
          "CHEMBL1360426",
          "CHEMBL1360997",
          "CHEMBL1364318",
          "CHEMBL1364371",
          "CHEMBL1365319",
          "CHEMBL1366620",
          "CHEMBL1366987",
          "CHEMBL1368744",
          "CHEMBL1370128",
          "CHEMBL1370218",
          "CHEMBL1370771",
          "CHEMBL1372488",
          "CHEMBL1372970",
          "CHEMBL1373205",
          "CHEMBL1374954",
          "CHEMBL1376288",
          "CHEMBL1376325",
          "CHEMBL1376342",
          "CHEMBL1377409",
          "CHEMBL1377690",
          "CHEMBL1377743",
          "CHEMBL1378687",
          "CHEMBL1379143",
          "CHEMBL1380897",
          "CHEMBL1381600",
          "CHEMBL1383077",
          "CHEMBL1383592",
          "CHEMBL1383610",
          "CHEMBL1383943",
          "CHEMBL1385608",
          "CHEMBL1386178",
          "CHEMBL1386511",
          "CHEMBL1386851",
          "CHEMBL1387309",
          "CHEMBL1388676",
          "CHEMBL1388940",
          "CHEMBL1389702",
          "CHEMBL1389982",
          "CHEMBL1390758",
          "CHEMBL1391119",
          "CHEMBL1391161",
          "CHEMBL1392785",
          "CHEMBL1392858",
          "CHEMBL1393538",
          "CHEMBL1398754",
          "CHEMBL1402158",
          "CHEMBL1404069",
          "CHEMBL1406003",
          "CHEMBL1407634",
          "CHEMBL1407754",
          "CHEMBL1411218",
          "CHEMBL1411397",
          "CHEMBL1412141",
          "CHEMBL1412538",
          "CHEMBL1414494",
          "CHEMBL1418821",
          "CHEMBL1419048",
          "CHEMBL1419096",
          "CHEMBL1419672",
          "CHEMBL1421312",
          "CHEMBL1422262",
          "CHEMBL1422485",
          "CHEMBL1423382",
          "CHEMBL1423799",
          "CHEMBL1426022",
          "CHEMBL1426686",
          "CHEMBL1426722",
          "CHEMBL1426896",
          "CHEMBL1427504",
          "CHEMBL1427664",
          "CHEMBL1427691",
          "CHEMBL1427745",
          "CHEMBL1427860",
          "CHEMBL1428620",
          "CHEMBL1428935",
          "CHEMBL1431004",
          "CHEMBL1431189",
          "CHEMBL1431391",
          "CHEMBL1431891",
          "CHEMBL1432676",
          "CHEMBL1437860",
          "CHEMBL1439255",
          "CHEMBL1439337",
          "CHEMBL1439642",
          "CHEMBL1439981",
          "CHEMBL1446166",
          "CHEMBL1446405",
          "CHEMBL1447448",
          "CHEMBL1448647",
          "CHEMBL1449113",
          "CHEMBL1450706",
          "CHEMBL1452153",
          "CHEMBL1452524",
          "CHEMBL1453672",
          "CHEMBL1453776",
          "CHEMBL1453832",
          "CHEMBL1454903",
          "CHEMBL1455508",
          "CHEMBL1456185",
          "CHEMBL1457093",
          "CHEMBL1457690",
          "CHEMBL1458887",
          "CHEMBL1461853",
          "CHEMBL1462215",
          "CHEMBL1462447",
          "CHEMBL1465891",
          "CHEMBL1467233",
          "CHEMBL1468302",
          "CHEMBL1468490",
          "CHEMBL1468579",
          "CHEMBL1468639",
          "CHEMBL1471202",
          "CHEMBL1471370",
          "CHEMBL1471779",
          "CHEMBL1471980",
          "CHEMBL1478155",
          "CHEMBL1480102",
          "CHEMBL1480648",
          "CHEMBL1482513",
          "CHEMBL1482637",
          "CHEMBL1482965",
          "CHEMBL1483363",
          "CHEMBL1483506",
          "CHEMBL1483730",
          "CHEMBL1485064",
          "CHEMBL1487131",
          "CHEMBL1490782",
          "CHEMBL1493277",
          "CHEMBL1493500",
          "CHEMBL1495022",
          "CHEMBL1499276",
          "CHEMBL1501390",
          "CHEMBL1502859",
          "CHEMBL1504083",
          "CHEMBL1504701",
          "CHEMBL1505552",
          "CHEMBL1506914",
          "CHEMBL1507807",
          "CHEMBL1509886",
          "CHEMBL1511420",
          "CHEMBL1517881",
          "CHEMBL1519263",
          "CHEMBL1519588",
          "CHEMBL1522356",
          "CHEMBL1525599",
          "CHEMBL1526917",
          "CHEMBL1527817",
          "CHEMBL1528149",
          "CHEMBL1529667",
          "CHEMBL1531118",
          "CHEMBL1531251",
          "CHEMBL1531745",
          "CHEMBL1533962",
          "CHEMBL1534058",
          "CHEMBL1534392",
          "CHEMBL1537587",
          "CHEMBL1537995",
          "CHEMBL1538198",
          "CHEMBL1538224",
          "CHEMBL1538646",
          "CHEMBL1538792",
          "CHEMBL1539256",
          "CHEMBL1539257",
          "CHEMBL1541596",
          "CHEMBL1543306",
          "CHEMBL1544103",
          "CHEMBL1544847",
          "CHEMBL1545205",
          "CHEMBL1545377",
          "CHEMBL1545811",
          "CHEMBL1545971",
          "CHEMBL1546304",
          "CHEMBL1547757",
          "CHEMBL1548605",
          "CHEMBL1549309",
          "CHEMBL1550015",
          "CHEMBL1550184",
          "CHEMBL1555711",
          "CHEMBL1556867",
          "CHEMBL1556933",
          "CHEMBL1559259",
          "CHEMBL1560379",
          "CHEMBL1560529",
          "CHEMBL1562533",
          "CHEMBL1562842",
          "CHEMBL1563162",
          "CHEMBL1566170",
          "CHEMBL1567983",
          "CHEMBL1568243",
          "CHEMBL1570844",
          "CHEMBL1572588",
          "CHEMBL1573112",
          "CHEMBL1573504",
          "CHEMBL1573719",
          "CHEMBL1574689",
          "CHEMBL1575649",
          "CHEMBL1578798",
          "CHEMBL1579872",
          "CHEMBL1580409",
          "CHEMBL1581332",
          "CHEMBL1583097",
          "CHEMBL1585445",
          "CHEMBL1585652",
          "CHEMBL1586118",
          "CHEMBL1587173",
          "CHEMBL1587468",
          "CHEMBL1597558",
          "CHEMBL1599610",
          "CHEMBL1600727",
          "CHEMBL1602800",
          "CHEMBL1603366",
          "CHEMBL1603927",
          "CHEMBL1603946",
          "CHEMBL1608455",
          "CHEMBL1608982",
          "CHEMBL1609320",
          "CHEMBL1609697",
          "CHEMBL1610409",
          "CHEMBL1707",
          "CHEMBL17645",
          "CHEMBL1771259",
          "CHEMBL1774211",
          "CHEMBL1774344",
          "CHEMBL1784130",
          "CHEMBL1823341",
          "CHEMBL1823342",
          "CHEMBL1823343",
          "CHEMBL1823344",
          "CHEMBL1823345",
          "CHEMBL1823346",
          "CHEMBL1823347",
          "CHEMBL1823348",
          "CHEMBL1823349",
          "CHEMBL1823350",
          "CHEMBL1823351",
          "CHEMBL1823352",
          "CHEMBL1823353",
          "CHEMBL1823354",
          "CHEMBL1823355",
          "CHEMBL1823356",
          "CHEMBL1823357",
          "CHEMBL1823358",
          "CHEMBL1823359",
          "CHEMBL1823360",
          "CHEMBL1823575",
          "CHEMBL1823576",
          "CHEMBL1823577",
          "CHEMBL1823578",
          "CHEMBL1836103",
          "CHEMBL1836316",
          "CHEMBL1836317",
          "CHEMBL1836318",
          "CHEMBL1870697",
          "CHEMBL1973629",
          "CHEMBL1979957",
          "CHEMBL1984816",
          "CHEMBL1986557",
          "CHEMBL1990096",
          "CHEMBL1995800",
          "CHEMBL2004475",
          "CHEMBL2029356",
          "CHEMBL2029960",
          "CHEMBL2029961",
          "CHEMBL2030145",
          "CHEMBL2030146",
          "CHEMBL2030147",
          "CHEMBL2030148",
          "CHEMBL2030149",
          "CHEMBL2030150",
          "CHEMBL2030151",
          "CHEMBL2030152",
          "CHEMBL2030153",
          "CHEMBL2030154",
          "CHEMBL2030155",
          "CHEMBL2030156",
          "CHEMBL2030157",
          "CHEMBL2030158",
          "CHEMBL2030159",
          "CHEMBL2030161",
          "CHEMBL2030162",
          "CHEMBL2030163",
          "CHEMBL2030164",
          "CHEMBL2030165",
          "CHEMBL2030169",
          "CHEMBL2030171",
          "CHEMBL2030172",
          "CHEMBL2030175",
          "CHEMBL2030176",
          "CHEMBL2030179",
          "CHEMBL2030180",
          "CHEMBL2030182",
          "CHEMBL2030183",
          "CHEMBL2030185",
          "CHEMBL2030186",
          "CHEMBL2030187",
          "CHEMBL2030188",
          "CHEMBL2030189",
          "CHEMBL2030190",
          "CHEMBL2030191",
          "CHEMBL2030192",
          "CHEMBL2030193",
          "CHEMBL2030196",
          "CHEMBL20400",
          "CHEMBL20549",
          "CHEMBL20553",
          "CHEMBL20773",
          "CHEMBL2079654",
          "CHEMBL20965",
          "CHEMBL21019",
          "CHEMBL21071",
          "CHEMBL2110196",
          "CHEMBL2110365",
          "CHEMBL2111764",
          "CHEMBL21283",
          "CHEMBL214707",
          "CHEMBL21502",
          "CHEMBL21507",
          "CHEMBL21523",
          "CHEMBL21545",
          "CHEMBL21605",
          "CHEMBL21616",
          "CHEMBL21652",
          "CHEMBL21670",
          "CHEMBL21679",
          "CHEMBL21728",
          "CHEMBL21737",
          "CHEMBL21753",
          "CHEMBL217692",
          "CHEMBL21877",
          "CHEMBL21907",
          "CHEMBL21935",
          "CHEMBL21941",
          "CHEMBL21992",
          "CHEMBL21997",
          "CHEMBL22046",
          "CHEMBL22056",
          "CHEMBL22105",
          "CHEMBL22119",
          "CHEMBL22131",
          "CHEMBL22174",
          "CHEMBL227456",
          "CHEMBL22840",
          "CHEMBL2307889",
          "CHEMBL2324952",
          "CHEMBL234198",
          "CHEMBL238533",
          "CHEMBL241105",
          "CHEMBL257940",
          "CHEMBL262083",
          "CHEMBL262221",
          "CHEMBL263350",
          "CHEMBL263848",
          "CHEMBL265008",
          "CHEMBL265065",
          "CHEMBL265391",
          "CHEMBL265426",
          "CHEMBL265637",
          "CHEMBL265849",
          "CHEMBL266021",
          "CHEMBL266077",
          "CHEMBL266730",
          "CHEMBL266814",
          "CHEMBL267633",
          "CHEMBL268200",
          "CHEMBL268351",
          "CHEMBL268409",
          "CHEMBL268554",
          "CHEMBL269267",
          "CHEMBL269503",
          "CHEMBL278795",
          "CHEMBL279044",
          "CHEMBL279236",
          "CHEMBL279289",
          "CHEMBL279493",
          "CHEMBL280372",
          "CHEMBL281387",
          "CHEMBL282057",
          "CHEMBL282667",
          "CHEMBL283106",
          "CHEMBL290175",
          "CHEMBL306277",
          "CHEMBL308130",
          "CHEMBL311159",
          "CHEMBL311229",
          "CHEMBL311506",
          "CHEMBL311552",
          "CHEMBL316153",
          "CHEMBL317075",
          "CHEMBL317554",
          "CHEMBL319562",
          "CHEMBL324554",
          "CHEMBL328860",
          "CHEMBL328861",
          "CHEMBL329536",
          "CHEMBL331202",
          "CHEMBL331937",
          "CHEMBL332347",
          "CHEMBL340369",
          "CHEMBL384306",
          "CHEMBL385339",
          "CHEMBL386202",
          "CHEMBL386823",
          "CHEMBL392889",
          "CHEMBL393255",
          "CHEMBL397527",
          "CHEMBL397528",
          "CHEMBL397529",
          "CHEMBL405527",
          "CHEMBL406025",
          "CHEMBL406128",
          "CHEMBL407742",
          "CHEMBL408891",
          "CHEMBL409167",
          "CHEMBL409634",
          "CHEMBL410007",
          "CHEMBL410166",
          "CHEMBL410502",
          "CHEMBL410780",
          "CHEMBL410792",
          "CHEMBL410938",
          "CHEMBL411117",
          "CHEMBL411200",
          "CHEMBL411637",
          "CHEMBL411765",
          "CHEMBL411766",
          "CHEMBL411793",
          "CHEMBL411800",
          "CHEMBL411979",
          "CHEMBL412191",
          "CHEMBL412257",
          "CHEMBL412378",
          "CHEMBL412698",
          "CHEMBL412704",
          "CHEMBL413232",
          "CHEMBL413399",
          "CHEMBL413426",
          "CHEMBL413455",
          "CHEMBL413612",
          "CHEMBL413637",
          "CHEMBL413638",
          "CHEMBL413658",
          "CHEMBL413871",
          "CHEMBL414051",
          "CHEMBL414267",
          "CHEMBL414482",
          "CHEMBL41457",
          "CHEMBL414827",
          "CHEMBL414947",
          "CHEMBL415176",
          "CHEMBL415187",
          "CHEMBL415644",
          "CHEMBL416005",
          "CHEMBL41686",
          "CHEMBL417100",
          "CHEMBL417641",
          "CHEMBL417727",
          "CHEMBL419086",
          "CHEMBL420630",
          "CHEMBL421549",
          "CHEMBL425080",
          "CHEMBL425095",
          "CHEMBL427594",
          "CHEMBL427922",
          "CHEMBL427966",
          "CHEMBL427974",
          "CHEMBL428017",
          "CHEMBL428292",
          "CHEMBL428320",
          "CHEMBL428992",
          "CHEMBL429005",
          "CHEMBL429071",
          "CHEMBL429159",
          "CHEMBL429389",
          "CHEMBL429531",
          "CHEMBL429698",
          "CHEMBL429905",
          "CHEMBL430274",
          "CHEMBL430532",
          "CHEMBL432651",
          "CHEMBL436493",
          "CHEMBL436499",
          "CHEMBL436630",
          "CHEMBL437290",
          "CHEMBL437421",
          "CHEMBL437487",
          "CHEMBL437656",
          "CHEMBL437671",
          "CHEMBL437863",
          "CHEMBL438211",
          "CHEMBL438411",
          "CHEMBL438548",
          "CHEMBL438580",
          "CHEMBL438914",
          "CHEMBL438923",
          "CHEMBL438935",
          "CHEMBL438945",
          "CHEMBL439122",
          "CHEMBL439307",
          "CHEMBL439884",
          "CHEMBL439904",
          "CHEMBL440278",
          "CHEMBL440824",
          "CHEMBL441007",
          "CHEMBL441204",
          "CHEMBL441396",
          "CHEMBL441516",
          "CHEMBL441936",
          "CHEMBL442182",
          "CHEMBL44246",
          "CHEMBL470495",
          "CHEMBL483251",
          "CHEMBL490427",
          "CHEMBL491288",
          "CHEMBL491762",
          "CHEMBL491930",
          "CHEMBL496",
          "CHEMBL496327",
          "CHEMBL497359",
          "CHEMBL497569",
          "CHEMBL508271",
          "CHEMBL521750",
          "CHEMBL522589",
          "CHEMBL526034",
          "CHEMBL530291",
          "CHEMBL539730",
          "CHEMBL540466",
          "CHEMBL549565",
          "CHEMBL549771",
          "CHEMBL549895",
          "CHEMBL549976",
          "CHEMBL550504",
          "CHEMBL550559",
          "CHEMBL550583",
          "CHEMBL551311",
          "CHEMBL551715",
          "CHEMBL552112",
          "CHEMBL552393",
          "CHEMBL556481",
          "CHEMBL557098",
          "CHEMBL557502",
          "CHEMBL559662",
          "CHEMBL560117",
          "CHEMBL560716",
          "CHEMBL560914",
          "CHEMBL561313",
          "CHEMBL561577",
          "CHEMBL561719",
          "CHEMBL562179",
          "CHEMBL562725",
          "CHEMBL563037",
          "CHEMBL563568",
          "CHEMBL563650",
          "CHEMBL564159",
          "CHEMBL564979",
          "CHEMBL567112",
          "CHEMBL567495",
          "CHEMBL585711",
          "CHEMBL591971",
          "CHEMBL604165",
          "CHEMBL65374",
          "CHEMBL77273",
          "CHEMBL77276",
          "CHEMBL77333",
          "CHEMBL77589",
          "CHEMBL77769",
          "CHEMBL77770",
          "CHEMBL77776",
          "CHEMBL78040",
          "CHEMBL78109",
          "CHEMBL808",
          "CHEMBL82374",
          "CHEMBL83255",
          "CHEMBL95327",
          "CHEMBL95501",
          "CHEMBL95660",
          "CHEMBL95963",
          "CHEMBL97046",
          "CHEMBL98875",
          "CHEMBL99586"
        ],
        "number_of_missing_values": "0"
      },
      {
        "data_type": "numeric",
        "index": "1",
        "is_ignore": "false",
        "is_row_identifier": "false",
        "is_target": "false",
        "name": "nO",
        "number_of_missing_values": "0"
      },
      {
        "data_type": "numeric",
        "index": "2",
        "is_ignore": "false",
        "is_row_identifier": "false",
        "is_target": "false",
        "name": "nH",
        "number_of_missing_values": "0"
      },
      {
        "data_type": "numeric",
        "index": "3",
        "is_ignore": "false",
        "is_row_identifier": "false",
        "is_target": "false",
        "name": "SCBO",
        "number_of_missing_values": "0"
      },
      {
        "data_type": "numeric",
        "index": "4",
        "is_ignore": "false",
        "is_row_identifier": "false",
        "is_target": "false",
        "name": "nCsp3",
        "number_of_missing_values": "0"
      },
      {
        "data_type": "numeric",
        "index": "5",
        "is_ignore": "false",
        "is_row_identifier": "false",
        "is_target": "false",
        "name": "nCsp2",
        "number_of_missing_values": "0"
      },
      {
        "data_type": "numeric",
        "index": "6",
        "is_ignore": "false",
        "is_row_identifier": "false",
        "is_target": "false",
        "name": "nHet",
        "number_of_missing_values": "0"
      },
      {
        "data_type": "numeric",
        "index": "7",
        "is_ignore": "false",
        "is_row_identifier": "false",
        "is_target": "false",
        "name": "nN",
        "number_of_missing_values": "0"
      },
      {
        "data_type": "numeric",
        "index": "8",
        "is_ignore": "false",
        "is_row_identifier": "false",
        "is_target": "false",
        "name": "RBN",
        "number_of_missing_values": "0"
      },
      {
        "data_type": "numeric",
        "index": "9",
        "is_ignore": "false",
        "is_row_identifier": "false",
        "is_target": "false",
        "name": "Si",
        "number_of_missing_values": "0"
      },
      {
        "data_type": "numeric",
        "index": "10",
        "is_ignore": "false",
        "is_row_identifier": "false",
        "is_target": "false",
        "name": "nAT",
        "number_of_missing_values": "0"
      },
      {
        "data_type": "numeric",
        "index": "11",
        "is_ignore": "false",
        "is_row_identifier": "false",
        "is_target": "false",
        "name": "Sp",
        "number_of_missing_values": "0"
      },
      {
        "data_type": "numeric",
        "index": "12",
        "is_ignore": "false",
        "is_row_identifier": "false",
        "is_target": "false",
        "name": "Se",
        "number_of_missing_values": "0"
      },
      {
        "data_type": "numeric",
        "index": "13",
        "is_ignore": "false",
        "is_row_identifier": "false",
        "is_target": "false",
        "name": "nDB",
        "number_of_missing_values": "0"
      },
      {
        "data_type": "numeric",
        "index": "14",
        "is_ignore": "false",
        "is_row_identifier": "false",
        "is_target": "false",
        "name": "AMW",
        "number_of_missing_values": "0"
      },
      {
        "data_type": "numeric",
        "index": "15",
        "is_ignore": "false",
        "is_row_identifier": "false",
        "is_target": "false",
        "name": "nBT",
        "number_of_missing_values": "0"
      },
      {
        "data_type": "numeric",
        "index": "16",
        "is_ignore": "false",
        "is_row_identifier": "false",
        "is_target": "true",
        "name": "pXC50",
        "number_of_missing_values": "0"
      }
    ]
  }
}