{
  "data_set_description": {
    "collection_date": "November 2013",
    "creator": "Dr Jeremy Besnard, Dr Ivan Olier, Dr Noureddin Sadawi, Dr Larisa Soldatova, Dr Crina Grosan, Prof Ross King, Dr Richard Bickerton, Prof Andrew Hopkins and Dr Willem van Hoorn",
    "default_target_attribute": "pXC50",
    "description": "This dataset contains QSAR data (from ChEMBL version 17) showing activity values (unit is pseudo-pCI50) of several compounds on drug target ChEMBL_ID: CHEMBL1075134 (TID: 103063), and it has 30 rows and 1103 features (not including molecule IDs and class feature: molecule_id and pXC50). The features represent Molecular Descriptors which were generated from SMILES strings. Missing value imputation was applied to this dataset (By choosing the Median).",
    "description_version": "1",
    "file_id": "3263686",
    "format": "ARFF",
    "id": "25147",
    "licence": "Public",
    "md5_checksum": "523a5db6582dd91736ede5934bdbd620",
    "minio_url": "https://data.openml.org/datasets/0002/25147/dataset_25147.pq",
    "name": "QSAR-DATASET-FOR-DRUG-TARGET-CHEMBL1075134",
    "original_data_url": "https://www.ebi.ac.uk/chembl/target/inspect/CHEMBL1075134",
    "parquet_url": "https://data.openml.org/datasets/0002/25147/dataset_25147.pq",
    "processing_date": "2018-10-03 23:06:49",
    "row_id_attribute": "molecule_id",
    "status": "deactivated",
    "tag": [
      "MetaQSAR",
      "study_13"
    ],
    "upload_date": "2016-07-14T16:15:16",
    "url": "https://api.openml.org/data/v1/download/3263686/QSAR-DATASET-FOR-DRUG-TARGET-CHEMBL1075134.arff",
    "version": "7",
    "visibility": "public"
  }
}