"molecule_id","AMW","C.","pXC50"
{1 6.972,2 33.6,3 7.481}
{0 CHEMBL116185,1 7.093,2 31.6,3 7.68}
{0 CHEMBL117975,1 7.093,2 31.6,3 7.194}
{0 CHEMBL266976,1 7.016,2 35.4,3 9.222}
{0 CHEMBL267788,1 7.08,2 34.8,3 7.523}
{0 CHEMBL269186,1 7.08,2 34.8,3 9.699}
{0 CHEMBL325290,1 6.997,2 32.1,3 7.027}
{0 CHEMBL325517,1 7.14,2 33.9,3 7.347}
{0 CHEMBL326770,1 6.997,2 32.1,3 7.81}
{0 CHEMBL331606,1 7.14,2 33.9,3 9.367}
{0 CHEMBL384262,1 7.075,2 35.3,3 6.076}
{0 CHEMBL385751,1 7.035,2 34.8,3 9.721}
{0 CHEMBL386065,1 7.08,2 34.8,3 9.658}
{0 CHEMBL386133,1 7.016,2 35.4,3 8}
{0 CHEMBL406041,1 7.08,2 34.8,3 9}
{0 CHEMBL407343,1 7.084,2 34.7,3 8.921}
{0 CHEMBL409118,1 7.649,2 31.9,3 5.854}
{0 CHEMBL410577,1 7.08,2 34.8,3 9.301}
{0 CHEMBL414263,1 7.035,2 34.8,3 9.796}
{0 CHEMBL420318,1 6.972,2 33.6,3 9.699}
{0 CHEMBL420508,1 7.009,2 31.3,3 6.523}
{0 CHEMBL42678,1 7.434,2 32.9,3 4.866}
{0 CHEMBL429731,1 7.022,2 35.1,3 9.678}
