{
  "data_features": {
    "feature": [
      {
        "data_type": "nominal",
        "index": "0",
        "is_ignore": "false",
        "is_row_identifier": "true",
        "is_target": "false",
        "name": "molecule_id",
        "nominal_value": [
          "CHEMBL10097",
          "CHEMBL10272",
          "CHEMBL10309",
          "CHEMBL1075640",
          "CHEMBL1077807",
          "CHEMBL1077808",
          "CHEMBL1077809",
          "CHEMBL1077810",
          "CHEMBL1077811",
          "CHEMBL1077812",
          "CHEMBL1077813",
          "CHEMBL1077814",
          "CHEMBL1077815",
          "CHEMBL1077816",
          "CHEMBL1077817",
          "CHEMBL1077818",
          "CHEMBL1077819",
          "CHEMBL1077820",
          "CHEMBL1077821",
          "CHEMBL1077822",
          "CHEMBL1077823",
          "CHEMBL1077824",
          "CHEMBL1077825",
          "CHEMBL1077826",
          "CHEMBL1077827",
          "CHEMBL1077828",
          "CHEMBL1077829",
          "CHEMBL1077830",
          "CHEMBL1077831",
          "CHEMBL1077832",
          "CHEMBL1081164",
          "CHEMBL1082320",
          "CHEMBL1082360",
          "CHEMBL1082361",
          "CHEMBL1082388",
          "CHEMBL1082389",
          "CHEMBL1082623",
          "CHEMBL1082641",
          "CHEMBL1082648",
          "CHEMBL1082649",
          "CHEMBL1082660",
          "CHEMBL1082995",
          "CHEMBL1083024",
          "CHEMBL1083309",
          "CHEMBL1083310",
          "CHEMBL1083315",
          "CHEMBL1083316",
          "CHEMBL1083335",
          "CHEMBL1083645",
          "CHEMBL1083913",
          "CHEMBL1083928",
          "CHEMBL1083929",
          "CHEMBL1083954",
          "CHEMBL1083955",
          "CHEMBL1083956",
          "CHEMBL1084198",
          "CHEMBL1084199",
          "CHEMBL1084505",
          "CHEMBL1084506",
          "CHEMBL1085258",
          "CHEMBL1085327",
          "CHEMBL1085508",
          "CHEMBL1085509",
          "CHEMBL1085517",
          "CHEMBL1085565",
          "CHEMBL1085740",
          "CHEMBL1085741",
          "CHEMBL1085998",
          "CHEMBL1086040",
          "CHEMBL1086041",
          "CHEMBL1086232",
          "CHEMBL1086236",
          "CHEMBL1086241",
          "CHEMBL1086242",
          "CHEMBL1086280",
          "CHEMBL1086590",
          "CHEMBL1484738",
          "CHEMBL1681832",
          "CHEMBL1681833",
          "CHEMBL1681834",
          "CHEMBL1681835",
          "CHEMBL1681836",
          "CHEMBL1681837",
          "CHEMBL1681838",
          "CHEMBL1681839",
          "CHEMBL1681840",
          "CHEMBL1681841",
          "CHEMBL1681842",
          "CHEMBL1681843",
          "CHEMBL1681844",
          "CHEMBL1681845",
          "CHEMBL1681846",
          "CHEMBL1681847",
          "CHEMBL1681848",
          "CHEMBL1681849",
          "CHEMBL1681850",
          "CHEMBL1681851",
          "CHEMBL1681852",
          "CHEMBL1681853",
          "CHEMBL1681854",
          "CHEMBL1681855",
          "CHEMBL1681856",
          "CHEMBL1681857",
          "CHEMBL1681858",
          "CHEMBL1681859",
          "CHEMBL1681860",
          "CHEMBL1681861",
          "CHEMBL1681862",
          "CHEMBL1681863",
          "CHEMBL1681864",
          "CHEMBL1681865",
          "CHEMBL1681866",
          "CHEMBL1681867",
          "CHEMBL1681868",
          "CHEMBL1681869",
          "CHEMBL1681870",
          "CHEMBL1681871",
          "CHEMBL1681872",
          "CHEMBL1681873",
          "CHEMBL1681874",
          "CHEMBL1681875",
          "CHEMBL1681876",
          "CHEMBL1681877",
          "CHEMBL1681878",
          "CHEMBL1681879",
          "CHEMBL1681880",
          "CHEMBL1681881",
          "CHEMBL1681882",
          "CHEMBL1681883",
          "CHEMBL1681884",
          "CHEMBL1806523",
          "CHEMBL1808994",
          "CHEMBL1808995",
          "CHEMBL1808996",
          "CHEMBL1808997",
          "CHEMBL1808998",
          "CHEMBL1808999",
          "CHEMBL1809000",
          "CHEMBL1809001",
          "CHEMBL1809002",
          "CHEMBL1809003",
          "CHEMBL1809004",
          "CHEMBL1809005",
          "CHEMBL1809006",
          "CHEMBL1809007",
          "CHEMBL1809008",
          "CHEMBL1809009",
          "CHEMBL1809010",
          "CHEMBL1809011",
          "CHEMBL1809012",
          "CHEMBL1809013",
          "CHEMBL1809014",
          "CHEMBL1809015",
          "CHEMBL1809016",
          "CHEMBL1809017",
          "CHEMBL1809018",
          "CHEMBL1809019",
          "CHEMBL1809020",
          "CHEMBL1809021",
          "CHEMBL1809022",
          "CHEMBL1809023",
          "CHEMBL1809024",
          "CHEMBL1809025",
          "CHEMBL1809026",
          "CHEMBL1809027",
          "CHEMBL1809028",
          "CHEMBL1809029",
          "CHEMBL1809030",
          "CHEMBL1809031",
          "CHEMBL1809032",
          "CHEMBL1809033",
          "CHEMBL1809034",
          "CHEMBL1809035",
          "CHEMBL1809036",
          "CHEMBL1809037",
          "CHEMBL1809038",
          "CHEMBL1809039",
          "CHEMBL1809040",
          "CHEMBL1809041",
          "CHEMBL1809042",
          "CHEMBL1809043",
          "CHEMBL1921858",
          "CHEMBL1921859",
          "CHEMBL1921860",
          "CHEMBL1921861",
          "CHEMBL1921862",
          "CHEMBL1921863",
          "CHEMBL1921864",
          "CHEMBL1921865",
          "CHEMBL1921866",
          "CHEMBL1921867",
          "CHEMBL1921868",
          "CHEMBL1921869",
          "CHEMBL1921870",
          "CHEMBL1921871",
          "CHEMBL1921872",
          "CHEMBL1921873",
          "CHEMBL1921874",
          "CHEMBL1921875",
          "CHEMBL1921876",
          "CHEMBL1921877",
          "CHEMBL1921878",
          "CHEMBL1921879",
          "CHEMBL1921880",
          "CHEMBL1921881",
          "CHEMBL1921882",
          "CHEMBL1921883",
          "CHEMBL1921884",
          "CHEMBL1921885",
          "CHEMBL1921886",
          "CHEMBL1921887",
          "CHEMBL1921888",
          "CHEMBL1921889",
          "CHEMBL1921890",
          "CHEMBL1921891",
          "CHEMBL1921892",
          "CHEMBL1921893",
          "CHEMBL1921894",
          "CHEMBL1921895",
          "CHEMBL1921896",
          "CHEMBL193448",
          "CHEMBL1938408",
          "CHEMBL1939553",
          "CHEMBL1939554",
          "CHEMBL1939555",
          "CHEMBL1939556",
          "CHEMBL1939557",
          "CHEMBL1939558",
          "CHEMBL1939559",
          "CHEMBL1939560",
          "CHEMBL1939561",
          "CHEMBL1939562",
          "CHEMBL1939692",
          "CHEMBL1939697",
          "CHEMBL194494",
          "CHEMBL196248",
          "CHEMBL196885",
          "CHEMBL197368",
          "CHEMBL197818",
          "CHEMBL198076",
          "CHEMBL198237",
          "CHEMBL199301",
          "CHEMBL199321",
          "CHEMBL199370",
          "CHEMBL199406",
          "CHEMBL199408",
          "CHEMBL199563",
          "CHEMBL199698",
          "CHEMBL199839",
          "CHEMBL199847",
          "CHEMBL200665",
          "CHEMBL200759",
          "CHEMBL200891",
          "CHEMBL2018969",
          "CHEMBL202086",
          "CHEMBL202136",
          "CHEMBL202289",
          "CHEMBL21343",
          "CHEMBL2181441",
          "CHEMBL2181442",
          "CHEMBL2181443",
          "CHEMBL2181444",
          "CHEMBL2181445",
          "CHEMBL2181446",
          "CHEMBL2181447",
          "CHEMBL2181448",
          "CHEMBL2181449",
          "CHEMBL2181450",
          "CHEMBL2181451",
          "CHEMBL2181452",
          "CHEMBL2181453",
          "CHEMBL2181454",
          "CHEMBL2181455",
          "CHEMBL2181456",
          "CHEMBL2181457",
          "CHEMBL2181458",
          "CHEMBL2181459",
          "CHEMBL2181460",
          "CHEMBL2181461",
          "CHEMBL2181462",
          "CHEMBL2181463",
          "CHEMBL2181464",
          "CHEMBL2181465",
          "CHEMBL2181466",
          "CHEMBL2181467",
          "CHEMBL2203305",
          "CHEMBL2205055",
          "CHEMBL2205056",
          "CHEMBL2205057",
          "CHEMBL2205058",
          "CHEMBL2205059",
          "CHEMBL2205060",
          "CHEMBL2205061",
          "CHEMBL2205062",
          "CHEMBL2205063",
          "CHEMBL2205064",
          "CHEMBL2205065",
          "CHEMBL2205066",
          "CHEMBL2205067",
          "CHEMBL2205068",
          "CHEMBL2205069",
          "CHEMBL2205070",
          "CHEMBL2205071",
          "CHEMBL2205072",
          "CHEMBL2205073",
          "CHEMBL2205074",
          "CHEMBL2205075",
          "CHEMBL2205076",
          "CHEMBL2205077",
          "CHEMBL2205078",
          "CHEMBL2205079",
          "CHEMBL2205080",
          "CHEMBL2205081",
          "CHEMBL2205082",
          "CHEMBL2205083",
          "CHEMBL2205084",
          "CHEMBL2205085",
          "CHEMBL2205086",
          "CHEMBL2205686",
          "CHEMBL2205687",
          "CHEMBL2205688",
          "CHEMBL2205689",
          "CHEMBL2205690",
          "CHEMBL2205691",
          "CHEMBL2205692",
          "CHEMBL2205693",
          "CHEMBL2205694",
          "CHEMBL2205695",
          "CHEMBL2205696",
          "CHEMBL2205697",
          "CHEMBL2205698",
          "CHEMBL2205699",
          "CHEMBL2205700",
          "CHEMBL2205701",
          "CHEMBL2205702",
          "CHEMBL2205703",
          "CHEMBL2205704",
          "CHEMBL2205705",
          "CHEMBL2205706",
          "CHEMBL2205707",
          "CHEMBL2205708",
          "CHEMBL2205709",
          "CHEMBL2205710",
          "CHEMBL2205711",
          "CHEMBL2205712",
          "CHEMBL2205713",
          "CHEMBL2205714",
          "CHEMBL2205715",
          "CHEMBL2205716",
          "CHEMBL2205718",
          "CHEMBL2205719",
          "CHEMBL2205720",
          "CHEMBL2205721",
          "CHEMBL2205722",
          "CHEMBL2205723",
          "CHEMBL228273",
          "CHEMBL230018",
          "CHEMBL230019",
          "CHEMBL230020",
          "CHEMBL230126",
          "CHEMBL230127",
          "CHEMBL230237",
          "CHEMBL230343",
          "CHEMBL230344",
          "CHEMBL230453",
          "CHEMBL230454",
          "CHEMBL230559",
          "CHEMBL230560",
          "CHEMBL230663",
          "CHEMBL230664",
          "CHEMBL231485",
          "CHEMBL231486",
          "CHEMBL231487",
          "CHEMBL231587",
          "CHEMBL231588",
          "CHEMBL231589",
          "CHEMBL242045",
          "CHEMBL242267",
          "CHEMBL242268",
          "CHEMBL242889",
          "CHEMBL243114",
          "CHEMBL243115",
          "CHEMBL243131",
          "CHEMBL243340",
          "CHEMBL243341",
          "CHEMBL244185",
          "CHEMBL244186",
          "CHEMBL244187",
          "CHEMBL244398",
          "CHEMBL244399",
          "CHEMBL244400",
          "CHEMBL244603",
          "CHEMBL244604",
          "CHEMBL244605",
          "CHEMBL244610",
          "CHEMBL244814",
          "CHEMBL244816",
          "CHEMBL244821",
          "CHEMBL244822",
          "CHEMBL245033",
          "CHEMBL245034",
          "CHEMBL245257",
          "CHEMBL245271",
          "CHEMBL248632",
          "CHEMBL248633",
          "CHEMBL248634",
          "CHEMBL248773",
          "CHEMBL248783",
          "CHEMBL249014",
          "CHEMBL249016",
          "CHEMBL249178",
          "CHEMBL249410",
          "CHEMBL249600",
          "CHEMBL249605",
          "CHEMBL249612",
          "CHEMBL250434",
          "CHEMBL250483",
          "CHEMBL250633",
          "CHEMBL250657",
          "CHEMBL250658",
          "CHEMBL251021",
          "CHEMBL251039",
          "CHEMBL251214",
          "CHEMBL252258",
          "CHEMBL252502",
          "CHEMBL252503",
          "CHEMBL252819",
          "CHEMBL252820",
          "CHEMBL253102",
          "CHEMBL253247",
          "CHEMBL253248",
          "CHEMBL253293",
          "CHEMBL253431",
          "CHEMBL253733",
          "CHEMBL253928",
          "CHEMBL254082",
          "CHEMBL254083",
          "CHEMBL254536",
          "CHEMBL254537",
          "CHEMBL254709",
          "CHEMBL255546",
          "CHEMBL255583",
          "CHEMBL255798",
          "CHEMBL255837",
          "CHEMBL256071",
          "CHEMBL256188",
          "CHEMBL256190",
          "CHEMBL256226",
          "CHEMBL256409",
          "CHEMBL256457",
          "CHEMBL256585",
          "CHEMBL256589",
          "CHEMBL256647",
          "CHEMBL256660",
          "CHEMBL256850",
          "CHEMBL256851",
          "CHEMBL256891",
          "CHEMBL257017",
          "CHEMBL257018",
          "CHEMBL257031",
          "CHEMBL257038",
          "CHEMBL257209",
          "CHEMBL257663",
          "CHEMBL257908",
          "CHEMBL258123",
          "CHEMBL258126",
          "CHEMBL258272",
          "CHEMBL266663",
          "CHEMBL269810",
          "CHEMBL269811",
          "CHEMBL269812",
          "CHEMBL269932",
          "CHEMBL269981",
          "CHEMBL270144",
          "CHEMBL270145",
          "CHEMBL270166",
          "CHEMBL270222",
          "CHEMBL270462",
          "CHEMBL270591",
          "CHEMBL270805",
          "CHEMBL270821",
          "CHEMBL271081",
          "CHEMBL271250",
          "CHEMBL271423",
          "CHEMBL271459",
          "CHEMBL271636",
          "CHEMBL271847",
          "CHEMBL272060",
          "CHEMBL272282",
          "CHEMBL272287",
          "CHEMBL272290",
          "CHEMBL272310",
          "CHEMBL272522",
          "CHEMBL272558",
          "CHEMBL272707",
          "CHEMBL272720",
          "CHEMBL272742",
          "CHEMBL272743",
          "CHEMBL272919",
          "CHEMBL273013",
          "CHEMBL274817",
          "CHEMBL370064",
          "CHEMBL370167",
          "CHEMBL370482",
          "CHEMBL370591",
          "CHEMBL371154",
          "CHEMBL371240",
          "CHEMBL371298",
          "CHEMBL371577",
          "CHEMBL372403",
          "CHEMBL372528",
          "CHEMBL372529",
          "CHEMBL372595",
          "CHEMBL373008",
          "CHEMBL374820",
          "CHEMBL374821",
          "CHEMBL375457",
          "CHEMBL380594",
          "CHEMBL381227",
          "CHEMBL381877",
          "CHEMBL382000",
          "CHEMBL382502",
          "CHEMBL382938",
          "CHEMBL383346",
          "CHEMBL387596",
          "CHEMBL390264",
          "CHEMBL394603",
          "CHEMBL394839",
          "CHEMBL394840",
          "CHEMBL395314",
          "CHEMBL395745",
          "CHEMBL395746",
          "CHEMBL395747",
          "CHEMBL395748",
          "CHEMBL395771",
          "CHEMBL395772",
          "CHEMBL395940",
          "CHEMBL395993",
          "CHEMBL396282",
          "CHEMBL396544",
          "CHEMBL396545",
          "CHEMBL396793",
          "CHEMBL397020",
          "CHEMBL397227",
          "CHEMBL397250",
          "CHEMBL397435",
          "CHEMBL397675",
          "CHEMBL397678",
          "CHEMBL397983",
          "CHEMBL397984",
          "CHEMBL398941",
          "CHEMBL399084",
          "CHEMBL399285",
          "CHEMBL399545",
          "CHEMBL399788",
          "CHEMBL400255",
          "CHEMBL400337",
          "CHEMBL400719",
          "CHEMBL400736",
          "CHEMBL400764",
          "CHEMBL401662",
          "CHEMBL401868",
          "CHEMBL401888",
          "CHEMBL401915",
          "CHEMBL401955",
          "CHEMBL401994",
          "CHEMBL401995",
          "CHEMBL402019",
          "CHEMBL402044",
          "CHEMBL402245",
          "CHEMBL402375",
          "CHEMBL402514",
          "CHEMBL402567",
          "CHEMBL402855",
          "CHEMBL402989",
          "CHEMBL403000",
          "CHEMBL403001",
          "CHEMBL403036",
          "CHEMBL403040",
          "CHEMBL403059",
          "CHEMBL403086",
          "CHEMBL403194",
          "CHEMBL403254",
          "CHEMBL403267",
          "CHEMBL403290",
          "CHEMBL403378",
          "CHEMBL403379",
          "CHEMBL403491",
          "CHEMBL403657",
          "CHEMBL403740",
          "CHEMBL403905",
          "CHEMBL403906",
          "CHEMBL404028",
          "CHEMBL404201",
          "CHEMBL404261",
          "CHEMBL404373",
          "CHEMBL404464",
          "CHEMBL404517",
          "CHEMBL404736",
          "CHEMBL404841",
          "CHEMBL404898",
          "CHEMBL409499",
          "CHEMBL409900",
          "CHEMBL411273",
          "CHEMBL425824",
          "CHEMBL425827",
          "CHEMBL427833",
          "CHEMBL428959",
          "CHEMBL429316",
          "CHEMBL429598",
          "CHEMBL430005",
          "CHEMBL436826",
          "CHEMBL437401",
          "CHEMBL437598",
          "CHEMBL437776",
          "CHEMBL437829",
          "CHEMBL439399",
          "CHEMBL440586",
          "CHEMBL444542",
          "CHEMBL446255",
          "CHEMBL446986",
          "CHEMBL455500",
          "CHEMBL456904",
          "CHEMBL456905",
          "CHEMBL458422",
          "CHEMBL459742",
          "CHEMBL459950",
          "CHEMBL459951",
          "CHEMBL464064",
          "CHEMBL464065",
          "CHEMBL464081",
          "CHEMBL464082",
          "CHEMBL464083",
          "CHEMBL464234",
          "CHEMBL464244",
          "CHEMBL464921",
          "CHEMBL464922",
          "CHEMBL464923",
          "CHEMBL465282",
          "CHEMBL465283",
          "CHEMBL465303",
          "CHEMBL465304",
          "CHEMBL465305",
          "CHEMBL465637",
          "CHEMBL465918",
          "CHEMBL468468",
          "CHEMBL469329",
          "CHEMBL469353",
          "CHEMBL469576",
          "CHEMBL469577",
          "CHEMBL469791",
          "CHEMBL470002",
          "CHEMBL470009",
          "CHEMBL470214",
          "CHEMBL470229",
          "CHEMBL470230",
          "CHEMBL470390",
          "CHEMBL470407",
          "CHEMBL470408",
          "CHEMBL470430",
          "CHEMBL470431",
          "CHEMBL470436",
          "CHEMBL470625",
          "CHEMBL470838",
          "CHEMBL470839",
          "CHEMBL470845",
          "CHEMBL471052",
          "CHEMBL471654",
          "CHEMBL472281",
          "CHEMBL472282",
          "CHEMBL472288",
          "CHEMBL472421",
          "CHEMBL472422",
          "CHEMBL472484",
          "CHEMBL472488",
          "CHEMBL472494",
          "CHEMBL472495",
          "CHEMBL479425",
          "CHEMBL479426",
          "CHEMBL479430",
          "CHEMBL479813",
          "CHEMBL479814",
          "CHEMBL479824",
          "CHEMBL479828",
          "CHEMBL479829",
          "CHEMBL480016",
          "CHEMBL480208",
          "CHEMBL480600",
          "CHEMBL480601",
          "CHEMBL480602",
          "CHEMBL480608",
          "CHEMBL480987",
          "CHEMBL480996",
          "CHEMBL480997",
          "CHEMBL481196",
          "CHEMBL481197",
          "CHEMBL481198",
          "CHEMBL481776",
          "CHEMBL481779",
          "CHEMBL481780",
          "CHEMBL482174",
          "CHEMBL482369",
          "CHEMBL482370",
          "CHEMBL495531",
          "CHEMBL495728",
          "CHEMBL495748",
          "CHEMBL495752",
          "CHEMBL495753",
          "CHEMBL495940",
          "CHEMBL496171",
          "CHEMBL496175",
          "CHEMBL496176",
          "CHEMBL496376",
          "CHEMBL496563",
          "CHEMBL496564",
          "CHEMBL496570",
          "CHEMBL496571",
          "CHEMBL496771",
          "CHEMBL496780",
          "CHEMBL496896",
          "CHEMBL497072",
          "CHEMBL497078",
          "CHEMBL497079",
          "CHEMBL497182",
          "CHEMBL497189",
          "CHEMBL497395",
          "CHEMBL497396",
          "CHEMBL497799",
          "CHEMBL497809",
          "CHEMBL498012",
          "CHEMBL498198",
          "CHEMBL498199",
          "CHEMBL498443",
          "CHEMBL498555",
          "CHEMBL498556",
          "CHEMBL498620",
          "CHEMBL506083",
          "CHEMBL506627",
          "CHEMBL508366",
          "CHEMBL511463",
          "CHEMBL511802",
          "CHEMBL511976",
          "CHEMBL512482",
          "CHEMBL512500",
          "CHEMBL512663",
          "CHEMBL512678",
          "CHEMBL513382",
          "CHEMBL514259",
          "CHEMBL516872",
          "CHEMBL517024",
          "CHEMBL517386",
          "CHEMBL517402",
          "CHEMBL517468",
          "CHEMBL517623",
          "CHEMBL518459",
          "CHEMBL518617",
          "CHEMBL518767",
          "CHEMBL518872",
          "CHEMBL519434",
          "CHEMBL521704",
          "CHEMBL521707",
          "CHEMBL522399",
          "CHEMBL522551",
          "CHEMBL523249",
          "CHEMBL523568",
          "CHEMBL523748",
          "CHEMBL523900",
          "CHEMBL523912",
          "CHEMBL524265",
          "CHEMBL524627",
          "CHEMBL526097",
          "CHEMBL527032",
          "CHEMBL553862",
          "CHEMBL565559",
          "CHEMBL565760",
          "CHEMBL565761",
          "CHEMBL565968",
          "CHEMBL565970",
          "CHEMBL565979",
          "CHEMBL565980",
          "CHEMBL568668",
          "CHEMBL568676",
          "CHEMBL568684",
          "CHEMBL569117",
          "CHEMBL569336",
          "CHEMBL570356",
          "CHEMBL570509",
          "CHEMBL570665",
          "CHEMBL570705",
          "CHEMBL570734",
          "CHEMBL570857",
          "CHEMBL570858",
          "CHEMBL570878",
          "CHEMBL570919",
          "CHEMBL570958",
          "CHEMBL571080",
          "CHEMBL571081",
          "CHEMBL571082",
          "CHEMBL571289",
          "CHEMBL571377",
          "CHEMBL571467",
          "CHEMBL571815",
          "CHEMBL573022",
          "CHEMBL573232",
          "CHEMBL573242",
          "CHEMBL573468",
          "CHEMBL573728",
          "CHEMBL574596",
          "CHEMBL574831",
          "CHEMBL575049",
          "CHEMBL575890",
          "CHEMBL576096",
          "CHEMBL576097",
          "CHEMBL576098",
          "CHEMBL576099",
          "CHEMBL576377",
          "CHEMBL576841",
          "CHEMBL576842",
          "CHEMBL577108",
          "CHEMBL577363",
          "CHEMBL577409",
          "CHEMBL577972",
          "CHEMBL577973",
          "CHEMBL578187",
          "CHEMBL578188",
          "CHEMBL578189",
          "CHEMBL578191",
          "CHEMBL578192",
          "CHEMBL578196",
          "CHEMBL578197",
          "CHEMBL578231",
          "CHEMBL578546",
          "CHEMBL578779",
          "CHEMBL579195",
          "CHEMBL583651",
          "CHEMBL583655",
          "CHEMBL583761",
          "CHEMBL584079",
          "CHEMBL584356",
          "CHEMBL584367",
          "CHEMBL584518",
          "CHEMBL584554",
          "CHEMBL587013",
          "CHEMBL587391",
          "CHEMBL595990",
          "CHEMBL604277",
          "CHEMBL604583"
        ],
        "number_of_missing_values": "0"
      },
      {
        "data_type": "numeric",
        "index": "1",
        "is_ignore": "false",
        "is_row_identifier": "false",
        "is_target": "false",
        "name": "AMW",
        "number_of_missing_values": "0"
      },
      {
        "data_type": "numeric",
        "index": "2",
        "is_ignore": "false",
        "is_row_identifier": "false",
        "is_target": "false",
        "name": "C.",
        "number_of_missing_values": "0"
      },
      {
        "data_type": "numeric",
        "index": "3",
        "is_ignore": "false",
        "is_row_identifier": "false",
        "is_target": "false",
        "name": "H.",
        "number_of_missing_values": "0"
      },
      {
        "data_type": "numeric",
        "index": "4",
        "is_ignore": "false",
        "is_row_identifier": "false",
        "is_target": "false",
        "name": "Me",
        "number_of_missing_values": "0"
      },
      {
        "data_type": "numeric",
        "index": "5",
        "is_ignore": "false",
        "is_row_identifier": "false",
        "is_target": "false",
        "name": "Mi",
        "number_of_missing_values": "0"
      },
      {
        "data_type": "numeric",
        "index": "6",
        "is_ignore": "false",
        "is_row_identifier": "false",
        "is_target": "false",
        "name": "Mp",
        "number_of_missing_values": "0"
      },
      {
        "data_type": "numeric",
        "index": "7",
        "is_ignore": "false",
        "is_row_identifier": "false",
        "is_target": "false",
        "name": "Mv",
        "number_of_missing_values": "0"
      },
      {
        "data_type": "numeric",
        "index": "8",
        "is_ignore": "false",
        "is_row_identifier": "false",
        "is_target": "false",
        "name": "MW",
        "number_of_missing_values": "0"
      },
      {
        "data_type": "numeric",
        "index": "9",
        "is_ignore": "false",
        "is_row_identifier": "false",
        "is_target": "false",
        "name": "N.",
        "number_of_missing_values": "0"
      },
      {
        "data_type": "numeric",
        "index": "10",
        "is_ignore": "false",
        "is_row_identifier": "false",
        "is_target": "false",
        "name": "nAB",
        "number_of_missing_values": "0"
      },
      {
        "data_type": "numeric",
        "index": "11",
        "is_ignore": "false",
        "is_row_identifier": "false",
        "is_target": "false",
        "name": "nAT",
        "number_of_missing_values": "0"
      },
      {
        "data_type": "numeric",
        "index": "12",
        "is_ignore": "false",
        "is_row_identifier": "false",
        "is_target": "false",
        "name": "nB",
        "number_of_missing_values": "0"
      },
      {
        "data_type": "numeric",
        "index": "13",
        "is_ignore": "false",
        "is_row_identifier": "false",
        "is_target": "false",
        "name": "nBM",
        "number_of_missing_values": "0"
      },
      {
        "data_type": "numeric",
        "index": "14",
        "is_ignore": "false",
        "is_row_identifier": "false",
        "is_target": "false",
        "name": "nBO",
        "number_of_missing_values": "0"
      },
      {
        "data_type": "numeric",
        "index": "15",
        "is_ignore": "false",
        "is_row_identifier": "false",
        "is_target": "false",
        "name": "nBR",
        "number_of_missing_values": "0"
      },
      {
        "data_type": "numeric",
        "index": "16",
        "is_ignore": "false",
        "is_row_identifier": "false",
        "is_target": "false",
        "name": "nBT",
        "number_of_missing_values": "0"
      },
      {
        "data_type": "numeric",
        "index": "17",
        "is_ignore": "false",
        "is_row_identifier": "false",
        "is_target": "false",
        "name": "nC",
        "number_of_missing_values": "0"
      },
      {
        "data_type": "numeric",
        "index": "18",
        "is_ignore": "false",
        "is_row_identifier": "false",
        "is_target": "false",
        "name": "nCL",
        "number_of_missing_values": "0"
      },
      {
        "data_type": "numeric",
        "index": "19",
        "is_ignore": "false",
        "is_row_identifier": "false",
        "is_target": "false",
        "name": "nCsp",
        "number_of_missing_values": "0"
      },
      {
        "data_type": "numeric",
        "index": "20",
        "is_ignore": "false",
        "is_row_identifier": "false",
        "is_target": "false",
        "name": "nCsp2",
        "number_of_missing_values": "0"
      },
      {
        "data_type": "numeric",
        "index": "21",
        "is_ignore": "false",
        "is_row_identifier": "false",
        "is_target": "false",
        "name": "nCsp3",
        "number_of_missing_values": "0"
      },
      {
        "data_type": "numeric",
        "index": "22",
        "is_ignore": "false",
        "is_row_identifier": "false",
        "is_target": "false",
        "name": "nDB",
        "number_of_missing_values": "0"
      },
      {
        "data_type": "numeric",
        "index": "23",
        "is_ignore": "false",
        "is_row_identifier": "false",
        "is_target": "false",
        "name": "nF",
        "number_of_missing_values": "0"
      },
      {
        "data_type": "numeric",
        "index": "24",
        "is_ignore": "false",
        "is_row_identifier": "false",
        "is_target": "false",
        "name": "nH",
        "number_of_missing_values": "0"
      },
      {
        "data_type": "numeric",
        "index": "25",
        "is_ignore": "false",
        "is_row_identifier": "false",
        "is_target": "false",
        "name": "nHet",
        "number_of_missing_values": "0"
      },
      {
        "data_type": "numeric",
        "index": "26",
        "is_ignore": "false",
        "is_row_identifier": "false",
        "is_target": "false",
        "name": "nHM",
        "number_of_missing_values": "0"
      },
      {
        "data_type": "numeric",
        "index": "27",
        "is_ignore": "false",
        "is_row_identifier": "false",
        "is_target": "false",
        "name": "nI",
        "number_of_missing_values": "0"
      },
      {
        "data_type": "numeric",
        "index": "28",
        "is_ignore": "false",
        "is_row_identifier": "false",
        "is_target": "false",
        "name": "nN",
        "number_of_missing_values": "0"
      },
      {
        "data_type": "numeric",
        "index": "29",
        "is_ignore": "false",
        "is_row_identifier": "false",
        "is_target": "false",
        "name": "nO",
        "number_of_missing_values": "0"
      },
      {
        "data_type": "numeric",
        "index": "30",
        "is_ignore": "false",
        "is_row_identifier": "false",
        "is_target": "false",
        "name": "nP",
        "number_of_missing_values": "0"
      },
      {
        "data_type": "numeric",
        "index": "31",
        "is_ignore": "false",
        "is_row_identifier": "false",
        "is_target": "false",
        "name": "nS",
        "number_of_missing_values": "0"
      },
      {
        "data_type": "numeric",
        "index": "32",
        "is_ignore": "false",
        "is_row_identifier": "false",
        "is_target": "false",
        "name": "nSK",
        "number_of_missing_values": "0"
      },
      {
        "data_type": "numeric",
        "index": "33",
        "is_ignore": "false",
        "is_row_identifier": "false",
        "is_target": "false",
        "name": "nTB",
        "number_of_missing_values": "0"
      },
      {
        "data_type": "numeric",
        "index": "34",
        "is_ignore": "false",
        "is_row_identifier": "false",
        "is_target": "false",
        "name": "nX",
        "number_of_missing_values": "0"
      },
      {
        "data_type": "numeric",
        "index": "35",
        "is_ignore": "false",
        "is_row_identifier": "false",
        "is_target": "false",
        "name": "O.",
        "number_of_missing_values": "0"
      },
      {
        "data_type": "numeric",
        "index": "36",
        "is_ignore": "false",
        "is_row_identifier": "false",
        "is_target": "false",
        "name": "RBF",
        "number_of_missing_values": "0"
      },
      {
        "data_type": "numeric",
        "index": "37",
        "is_ignore": "false",
        "is_row_identifier": "false",
        "is_target": "false",
        "name": "RBN",
        "number_of_missing_values": "0"
      },
      {
        "data_type": "numeric",
        "index": "38",
        "is_ignore": "false",
        "is_row_identifier": "false",
        "is_target": "false",
        "name": "SCBO",
        "number_of_missing_values": "0"
      },
      {
        "data_type": "numeric",
        "index": "39",
        "is_ignore": "false",
        "is_row_identifier": "false",
        "is_target": "false",
        "name": "Se",
        "number_of_missing_values": "0"
      },
      {
        "data_type": "numeric",
        "index": "40",
        "is_ignore": "false",
        "is_row_identifier": "false",
        "is_target": "false",
        "name": "Si",
        "number_of_missing_values": "0"
      },
      {
        "data_type": "numeric",
        "index": "41",
        "is_ignore": "false",
        "is_row_identifier": "false",
        "is_target": "false",
        "name": "Sp",
        "number_of_missing_values": "0"
      },
      {
        "data_type": "numeric",
        "index": "42",
        "is_ignore": "false",
        "is_row_identifier": "false",
        "is_target": "false",
        "name": "Sv",
        "number_of_missing_values": "0"
      },
      {
        "data_type": "numeric",
        "index": "43",
        "is_ignore": "false",
        "is_row_identifier": "false",
        "is_target": "false",
        "name": "X.",
        "number_of_missing_values": "0"
      },
      {
        "data_type": "numeric",
        "index": "44",
        "is_ignore": "false",
        "is_row_identifier": "false",
        "is_target": "true",
        "name": "pXC50",
        "number_of_missing_values": "0"
      }
    ]
  }
}