"molecule_id","C.","nCsp2","pXC50"
{1 40.3,2 15,3 4.167}
{0 CHEMBL1089024,1 40,2 15,3 4.398}
{0 CHEMBL1089398,1 39.4,2 14,3 4.347}
{0 CHEMBL1090867,1 40,2 15,3 4.167}
{0 CHEMBL1091045,1 40,2 15,3 4}
{0 CHEMBL1091216,1 40.8,2 15,3 4.161}
{0 CHEMBL1091453,1 39.4,2 14,3 4.62}
{0 CHEMBL1091484,1 40.3,2 15,3 4.167}
{0 CHEMBL1092759,1 40.3,2 15,3 4.357}
{0 CHEMBL1092760,1 39.4,2 14,3 4.444}
{0 CHEMBL1092761,1 39.4,2 14,3 4.31}
{0 CHEMBL1093339,1 40.3,2 15,3 4.276}
{0 CHEMBL1093356,1 38.4,2 13,3 4.495}
{0 CHEMBL2063869,1 36.2,2 11,3 7.301}
