{
  "data_set_description": {
    "collection_date": "November 2013",
    "creator": "Dr Jeremy Besnard, Dr Ivan Olier, Dr Noureddin Sadawi, Dr Larisa Soldatova, Dr Crina Grosan, Prof Ross King, Dr Richard Bickerton, Prof Andrew Hopkins and Dr Willem van Hoorn",
    "default_target_attribute": "pXC50",
    "description": "This dataset contains QSAR data (from ChEMBL version 17) showing activity values (unit is pseudo-pCI50) of several compounds on drug target ChEMBL_ID: CHEMBL5888 (TID: 101365), and it has 41 rows and 43 features (not including molecule IDs and class feature: molecule_id and pXC50). The features represent Basic Molecular Descriptors which were generated from SMILES strings.  Missing value imputation was applied to this dataset (By choosing the Median).",
    "description_version": "1",
    "file_id": "3262056",
    "format": "ARFF",
    "id": "25103",
    "licence": "Public",
    "md5_checksum": "fef2fb9b1a1fefbec365fcb119cb92a4",
    "minio_url": "https://data.openml.org/datasets/0002/25103/dataset_25103.pq",
    "name": "QSAR-DATASET-FOR-DRUG-TARGET-CHEMBL5888",
    "original_data_url": "https://www.ebi.ac.uk/chembl/target/inspect/CHEMBL5888",
    "parquet_url": "https://data.openml.org/datasets/0002/25103/dataset_25103.pq",
    "processing_date": "2018-10-03 23:08:08",
    "row_id_attribute": "molecule_id",
    "status": "deactivated",
    "tag": [
      "MetaQSAR",
      "study_13"
    ],
    "upload_date": "2016-07-14T16:08:55",
    "url": "https://api.openml.org/data/v1/download/3262056/QSAR-DATASET-FOR-DRUG-TARGET-CHEMBL5888.arff",
    "version": "8",
    "visibility": "public"
  }
}