{
  "data_set_description": {
    "collection_date": "November 2013",
    "creator": "Dr Jeremy Besnard, Dr Ivan Olier, Dr Noureddin Sadawi, Dr Larisa Soldatova, Dr Crina Grosan, Prof Ross King, Dr Richard Bickerton, Prof Andrew Hopkins and Dr Willem van Hoorn",
    "default_target_attribute": "pXC50",
    "description": "This dataset contains QSAR data (from ChEMBL version 17) showing activity values (unit is pseudo-pCI50) of several compounds on drug target ChEMBL_ID: CHEMBL2049 (TID: 116), and it has 794 rows and 1386 features (not including molecule IDs and class feature: molecule_id and pXC50). The features represent Molecular Descriptors which were generated from SMILES strings. Missing value imputation was applied to this dataset (By choosing the Median).",
    "description_version": "1",
    "file_id": "3261172",
    "format": "ARFF",
    "id": "25087",
    "licence": "Public",
    "md5_checksum": "0d1882fa8fea3161b385fa828b9c7ce8",
    "minio_url": "https://data.openml.org/datasets/0002/25087/dataset_25087.pq",
    "name": "QSAR-DATASET-FOR-DRUG-TARGET-CHEMBL2049",
    "original_data_url": "https://www.ebi.ac.uk/chembl/target/inspect/CHEMBL2049",
    "parquet_url": "https://data.openml.org/datasets/0002/25087/dataset_25087.pq",
    "processing_date": "2018-10-03 23:09:13",
    "row_id_attribute": "molecule_id",
    "status": "deactivated",
    "tag": [
      "MetaQSAR",
      "study_13"
    ],
    "upload_date": "2016-07-14T16:06:28",
    "url": "https://api.openml.org/data/v1/download/3261172/QSAR-DATASET-FOR-DRUG-TARGET-CHEMBL2049.arff",
    "version": "8",
    "visibility": "public"
  }
}