{
  "data_features": {
    "feature": [
      {
        "data_type": "nominal",
        "index": "0",
        "is_ignore": "false",
        "is_row_identifier": "true",
        "is_target": "false",
        "name": "molecule_id",
        "nominal_value": [
          "CHEMBL1085374",
          "CHEMBL1086110",
          "CHEMBL1221434",
          "CHEMBL128017",
          "CHEMBL128263",
          "CHEMBL128338",
          "CHEMBL128391",
          "CHEMBL128456",
          "CHEMBL128485",
          "CHEMBL128619",
          "CHEMBL128621",
          "CHEMBL128783",
          "CHEMBL128877",
          "CHEMBL129255",
          "CHEMBL129283",
          "CHEMBL129407",
          "CHEMBL129600",
          "CHEMBL129668",
          "CHEMBL129689",
          "CHEMBL129691",
          "CHEMBL129692",
          "CHEMBL130026",
          "CHEMBL130081",
          "CHEMBL131111",
          "CHEMBL131118",
          "CHEMBL131355",
          "CHEMBL131672",
          "CHEMBL131939",
          "CHEMBL1641615",
          "CHEMBL1642568",
          "CHEMBL1683806",
          "CHEMBL17423",
          "CHEMBL1777830",
          "CHEMBL1779335",
          "CHEMBL1779425",
          "CHEMBL1779429",
          "CHEMBL1779430",
          "CHEMBL1779431",
          "CHEMBL1779432",
          "CHEMBL1779433",
          "CHEMBL1779434",
          "CHEMBL1779444",
          "CHEMBL1779445",
          "CHEMBL1779446",
          "CHEMBL1779447",
          "CHEMBL1819121",
          "CHEMBL1819122",
          "CHEMBL1821774",
          "CHEMBL1821775",
          "CHEMBL1821787",
          "CHEMBL1821789",
          "CHEMBL1821790",
          "CHEMBL1821791",
          "CHEMBL182227",
          "CHEMBL182536",
          "CHEMBL182574",
          "CHEMBL182617",
          "CHEMBL183156",
          "CHEMBL183280",
          "CHEMBL183465",
          "CHEMBL183965",
          "CHEMBL184017",
          "CHEMBL184279",
          "CHEMBL184837",
          "CHEMBL184861",
          "CHEMBL184945",
          "CHEMBL184960",
          "CHEMBL185203",
          "CHEMBL185208",
          "CHEMBL185296",
          "CHEMBL185304",
          "CHEMBL185370",
          "CHEMBL185532",
          "CHEMBL185588",
          "CHEMBL185604",
          "CHEMBL189",
          "CHEMBL1911559",
          "CHEMBL1911572",
          "CHEMBL1915888",
          "CHEMBL1915891",
          "CHEMBL1915892",
          "CHEMBL1915896",
          "CHEMBL1915906",
          "CHEMBL1915910",
          "CHEMBL1915912",
          "CHEMBL1916091",
          "CHEMBL1916106",
          "CHEMBL1916108",
          "CHEMBL1916113",
          "CHEMBL1916114",
          "CHEMBL1916123",
          "CHEMBL1916124",
          "CHEMBL1916125",
          "CHEMBL1916130",
          "CHEMBL1916131",
          "CHEMBL1916132",
          "CHEMBL1916475",
          "CHEMBL19224",
          "CHEMBL1939912",
          "CHEMBL1939914",
          "CHEMBL1939915",
          "CHEMBL1940053",
          "CHEMBL1940056",
          "CHEMBL1940057",
          "CHEMBL1940058",
          "CHEMBL1946746",
          "CHEMBL1946747",
          "CHEMBL1946748",
          "CHEMBL1946932",
          "CHEMBL1946933",
          "CHEMBL1946934",
          "CHEMBL1946935",
          "CHEMBL1946936",
          "CHEMBL1946937",
          "CHEMBL1946938",
          "CHEMBL2016583",
          "CHEMBL2017057",
          "CHEMBL2017058",
          "CHEMBL2017059",
          "CHEMBL2017060",
          "CHEMBL2017061",
          "CHEMBL2017062",
          "CHEMBL2017064",
          "CHEMBL2017065",
          "CHEMBL2017066",
          "CHEMBL2017067",
          "CHEMBL2017069",
          "CHEMBL2017075",
          "CHEMBL2017078",
          "CHEMBL2017080",
          "CHEMBL2017081",
          "CHEMBL2017083",
          "CHEMBL2017086",
          "CHEMBL2017087",
          "CHEMBL2041596",
          "CHEMBL2041597",
          "CHEMBL2041604",
          "CHEMBL2041614",
          "CHEMBL2069591",
          "CHEMBL2069592",
          "CHEMBL2069593",
          "CHEMBL2069594",
          "CHEMBL2069595",
          "CHEMBL2069596",
          "CHEMBL2069597",
          "CHEMBL2069598",
          "CHEMBL2069599",
          "CHEMBL2069600",
          "CHEMBL2069601",
          "CHEMBL2069602",
          "CHEMBL2069603",
          "CHEMBL2069604",
          "CHEMBL2069605",
          "CHEMBL2069606",
          "CHEMBL2069607",
          "CHEMBL2069608",
          "CHEMBL2069609",
          "CHEMBL2069610",
          "CHEMBL2069611",
          "CHEMBL2096844",
          "CHEMBL2178115",
          "CHEMBL2179105",
          "CHEMBL218855",
          "CHEMBL218955",
          "CHEMBL219123",
          "CHEMBL219445",
          "CHEMBL219451",
          "CHEMBL220185",
          "CHEMBL2206212",
          "CHEMBL2206213",
          "CHEMBL2206214",
          "CHEMBL2206215",
          "CHEMBL2206216",
          "CHEMBL2206217",
          "CHEMBL2206218",
          "CHEMBL2206219",
          "CHEMBL2206220",
          "CHEMBL2206221",
          "CHEMBL2206222",
          "CHEMBL2206223",
          "CHEMBL2206224",
          "CHEMBL2206225",
          "CHEMBL2206226",
          "CHEMBL2313234",
          "CHEMBL2337953",
          "CHEMBL2337954",
          "CHEMBL2337955",
          "CHEMBL2337956",
          "CHEMBL2337957",
          "CHEMBL2337958",
          "CHEMBL2337959",
          "CHEMBL2337960",
          "CHEMBL2337961",
          "CHEMBL2337962",
          "CHEMBL2337963",
          "CHEMBL2337964",
          "CHEMBL2337965",
          "CHEMBL2337966",
          "CHEMBL2337967",
          "CHEMBL2337968",
          "CHEMBL2337969",
          "CHEMBL2337970",
          "CHEMBL2337971",
          "CHEMBL2337972",
          "CHEMBL2337973",
          "CHEMBL2337974",
          "CHEMBL2337975",
          "CHEMBL2337976",
          "CHEMBL251785",
          "CHEMBL252387",
          "CHEMBL255130",
          "CHEMBL255820",
          "CHEMBL259295",
          "CHEMBL260006",
          "CHEMBL261711",
          "CHEMBL262088",
          "CHEMBL263311",
          "CHEMBL263641",
          "CHEMBL263642",
          "CHEMBL270634",
          "CHEMBL270635",
          "CHEMBL270636",
          "CHEMBL270637",
          "CHEMBL273816",
          "CHEMBL338179",
          "CHEMBL338381",
          "CHEMBL338860",
          "CHEMBL339210",
          "CHEMBL340118",
          "CHEMBL340785",
          "CHEMBL341160",
          "CHEMBL341231",
          "CHEMBL341327",
          "CHEMBL341354",
          "CHEMBL34431",
          "CHEMBL359890",
          "CHEMBL360627",
          "CHEMBL360874",
          "CHEMBL361469",
          "CHEMBL363084",
          "CHEMBL363673",
          "CHEMBL363709",
          "CHEMBL365447",
          "CHEMBL366149",
          "CHEMBL374993",
          "CHEMBL375200",
          "CHEMBL385754",
          "CHEMBL387166",
          "CHEMBL387167",
          "CHEMBL404723",
          "CHEMBL408977",
          "CHEMBL408978",
          "CHEMBL409484",
          "CHEMBL409613",
          "CHEMBL409651",
          "CHEMBL409862",
          "CHEMBL410834",
          "CHEMBL421249",
          "CHEMBL427505",
          "CHEMBL427513",
          "CHEMBL427777",
          "CHEMBL428445",
          "CHEMBL429686",
          "CHEMBL430071",
          "CHEMBL441704",
          "CHEMBL466068",
          "CHEMBL466280",
          "CHEMBL466481",
          "CHEMBL551052",
          "CHEMBL567470",
          "CHEMBL571372",
          "CHEMBL572789",
          "CHEMBL583914",
          "CHEMBL589984",
          "CHEMBL591059",
          "CHEMBL591114",
          "CHEMBL591501",
          "CHEMBL591997",
          "CHEMBL592057",
          "CHEMBL592059",
          "CHEMBL592241",
          "CHEMBL592242",
          "CHEMBL592243",
          "CHEMBL601295",
          "CHEMBL603613"
        ],
        "number_of_missing_values": "0"
      },
      {
        "data_type": "numeric",
        "index": "1",
        "is_ignore": "false",
        "is_row_identifier": "false",
        "is_target": "false",
        "name": "AMW",
        "number_of_missing_values": "0"
      },
      {
        "data_type": "numeric",
        "index": "2",
        "is_ignore": "false",
        "is_row_identifier": "false",
        "is_target": "false",
        "name": "C.",
        "number_of_missing_values": "0"
      },
      {
        "data_type": "numeric",
        "index": "3",
        "is_ignore": "false",
        "is_row_identifier": "false",
        "is_target": "false",
        "name": "H.",
        "number_of_missing_values": "0"
      },
      {
        "data_type": "numeric",
        "index": "4",
        "is_ignore": "false",
        "is_row_identifier": "false",
        "is_target": "false",
        "name": "Me",
        "number_of_missing_values": "0"
      },
      {
        "data_type": "numeric",
        "index": "5",
        "is_ignore": "false",
        "is_row_identifier": "false",
        "is_target": "false",
        "name": "Mi",
        "number_of_missing_values": "0"
      },
      {
        "data_type": "numeric",
        "index": "6",
        "is_ignore": "false",
        "is_row_identifier": "false",
        "is_target": "false",
        "name": "Mp",
        "number_of_missing_values": "0"
      },
      {
        "data_type": "numeric",
        "index": "7",
        "is_ignore": "false",
        "is_row_identifier": "false",
        "is_target": "false",
        "name": "Mv",
        "number_of_missing_values": "0"
      },
      {
        "data_type": "numeric",
        "index": "8",
        "is_ignore": "false",
        "is_row_identifier": "false",
        "is_target": "false",
        "name": "MW",
        "number_of_missing_values": "0"
      },
      {
        "data_type": "numeric",
        "index": "9",
        "is_ignore": "false",
        "is_row_identifier": "false",
        "is_target": "false",
        "name": "N.",
        "number_of_missing_values": "0"
      },
      {
        "data_type": "numeric",
        "index": "10",
        "is_ignore": "false",
        "is_row_identifier": "false",
        "is_target": "false",
        "name": "nAB",
        "number_of_missing_values": "0"
      },
      {
        "data_type": "numeric",
        "index": "11",
        "is_ignore": "false",
        "is_row_identifier": "false",
        "is_target": "false",
        "name": "nAT",
        "number_of_missing_values": "0"
      },
      {
        "data_type": "numeric",
        "index": "12",
        "is_ignore": "false",
        "is_row_identifier": "false",
        "is_target": "false",
        "name": "nB",
        "number_of_missing_values": "0"
      },
      {
        "data_type": "numeric",
        "index": "13",
        "is_ignore": "false",
        "is_row_identifier": "false",
        "is_target": "false",
        "name": "nBM",
        "number_of_missing_values": "0"
      },
      {
        "data_type": "numeric",
        "index": "14",
        "is_ignore": "false",
        "is_row_identifier": "false",
        "is_target": "false",
        "name": "nBO",
        "number_of_missing_values": "0"
      },
      {
        "data_type": "numeric",
        "index": "15",
        "is_ignore": "false",
        "is_row_identifier": "false",
        "is_target": "false",
        "name": "nBR",
        "number_of_missing_values": "0"
      },
      {
        "data_type": "numeric",
        "index": "16",
        "is_ignore": "false",
        "is_row_identifier": "false",
        "is_target": "false",
        "name": "nBT",
        "number_of_missing_values": "0"
      },
      {
        "data_type": "numeric",
        "index": "17",
        "is_ignore": "false",
        "is_row_identifier": "false",
        "is_target": "false",
        "name": "nC",
        "number_of_missing_values": "0"
      },
      {
        "data_type": "numeric",
        "index": "18",
        "is_ignore": "false",
        "is_row_identifier": "false",
        "is_target": "false",
        "name": "nCL",
        "number_of_missing_values": "0"
      },
      {
        "data_type": "numeric",
        "index": "19",
        "is_ignore": "false",
        "is_row_identifier": "false",
        "is_target": "false",
        "name": "nCsp",
        "number_of_missing_values": "0"
      },
      {
        "data_type": "numeric",
        "index": "20",
        "is_ignore": "false",
        "is_row_identifier": "false",
        "is_target": "false",
        "name": "nCsp2",
        "number_of_missing_values": "0"
      },
      {
        "data_type": "numeric",
        "index": "21",
        "is_ignore": "false",
        "is_row_identifier": "false",
        "is_target": "false",
        "name": "nCsp3",
        "number_of_missing_values": "0"
      },
      {
        "data_type": "numeric",
        "index": "22",
        "is_ignore": "false",
        "is_row_identifier": "false",
        "is_target": "false",
        "name": "nDB",
        "number_of_missing_values": "0"
      },
      {
        "data_type": "numeric",
        "index": "23",
        "is_ignore": "false",
        "is_row_identifier": "false",
        "is_target": "false",
        "name": "nF",
        "number_of_missing_values": "0"
      },
      {
        "data_type": "numeric",
        "index": "24",
        "is_ignore": "false",
        "is_row_identifier": "false",
        "is_target": "false",
        "name": "nH",
        "number_of_missing_values": "0"
      },
      {
        "data_type": "numeric",
        "index": "25",
        "is_ignore": "false",
        "is_row_identifier": "false",
        "is_target": "false",
        "name": "nHet",
        "number_of_missing_values": "0"
      },
      {
        "data_type": "numeric",
        "index": "26",
        "is_ignore": "false",
        "is_row_identifier": "false",
        "is_target": "false",
        "name": "nHM",
        "number_of_missing_values": "0"
      },
      {
        "data_type": "numeric",
        "index": "27",
        "is_ignore": "false",
        "is_row_identifier": "false",
        "is_target": "false",
        "name": "nI",
        "number_of_missing_values": "0"
      },
      {
        "data_type": "numeric",
        "index": "28",
        "is_ignore": "false",
        "is_row_identifier": "false",
        "is_target": "false",
        "name": "nN",
        "number_of_missing_values": "0"
      },
      {
        "data_type": "numeric",
        "index": "29",
        "is_ignore": "false",
        "is_row_identifier": "false",
        "is_target": "false",
        "name": "nO",
        "number_of_missing_values": "0"
      },
      {
        "data_type": "numeric",
        "index": "30",
        "is_ignore": "false",
        "is_row_identifier": "false",
        "is_target": "false",
        "name": "nP",
        "number_of_missing_values": "0"
      },
      {
        "data_type": "numeric",
        "index": "31",
        "is_ignore": "false",
        "is_row_identifier": "false",
        "is_target": "false",
        "name": "nS",
        "number_of_missing_values": "0"
      },
      {
        "data_type": "numeric",
        "index": "32",
        "is_ignore": "false",
        "is_row_identifier": "false",
        "is_target": "false",
        "name": "nSK",
        "number_of_missing_values": "0"
      },
      {
        "data_type": "numeric",
        "index": "33",
        "is_ignore": "false",
        "is_row_identifier": "false",
        "is_target": "false",
        "name": "nTB",
        "number_of_missing_values": "0"
      },
      {
        "data_type": "numeric",
        "index": "34",
        "is_ignore": "false",
        "is_row_identifier": "false",
        "is_target": "false",
        "name": "nX",
        "number_of_missing_values": "0"
      },
      {
        "data_type": "numeric",
        "index": "35",
        "is_ignore": "false",
        "is_row_identifier": "false",
        "is_target": "false",
        "name": "O.",
        "number_of_missing_values": "0"
      },
      {
        "data_type": "numeric",
        "index": "36",
        "is_ignore": "false",
        "is_row_identifier": "false",
        "is_target": "false",
        "name": "RBF",
        "number_of_missing_values": "0"
      },
      {
        "data_type": "numeric",
        "index": "37",
        "is_ignore": "false",
        "is_row_identifier": "false",
        "is_target": "false",
        "name": "RBN",
        "number_of_missing_values": "0"
      },
      {
        "data_type": "numeric",
        "index": "38",
        "is_ignore": "false",
        "is_row_identifier": "false",
        "is_target": "false",
        "name": "SCBO",
        "number_of_missing_values": "0"
      },
      {
        "data_type": "numeric",
        "index": "39",
        "is_ignore": "false",
        "is_row_identifier": "false",
        "is_target": "false",
        "name": "Se",
        "number_of_missing_values": "0"
      },
      {
        "data_type": "numeric",
        "index": "40",
        "is_ignore": "false",
        "is_row_identifier": "false",
        "is_target": "false",
        "name": "Si",
        "number_of_missing_values": "0"
      },
      {
        "data_type": "numeric",
        "index": "41",
        "is_ignore": "false",
        "is_row_identifier": "false",
        "is_target": "false",
        "name": "Sp",
        "number_of_missing_values": "0"
      },
      {
        "data_type": "numeric",
        "index": "42",
        "is_ignore": "false",
        "is_row_identifier": "false",
        "is_target": "false",
        "name": "Sv",
        "number_of_missing_values": "0"
      },
      {
        "data_type": "numeric",
        "index": "43",
        "is_ignore": "false",
        "is_row_identifier": "false",
        "is_target": "false",
        "name": "X.",
        "number_of_missing_values": "0"
      },
      {
        "data_type": "numeric",
        "index": "44",
        "is_ignore": "false",
        "is_row_identifier": "false",
        "is_target": "true",
        "name": "pXC50",
        "number_of_missing_values": "0"
      }
    ]
  }
}