{
  "data_features": {
    "feature": [
      {
        "data_type": "nominal",
        "index": "0",
        "is_ignore": "false",
        "is_row_identifier": "true",
        "is_target": "false",
        "name": "molecule_id",
        "nominal_value": [
          "CHEMBL1121",
          "CHEMBL1159903",
          "CHEMBL1159904",
          "CHEMBL1159905",
          "CHEMBL1159906",
          "CHEMBL1159909",
          "CHEMBL1159910",
          "CHEMBL1159911",
          "CHEMBL1159912",
          "CHEMBL1159915",
          "CHEMBL1160485",
          "CHEMBL1160486",
          "CHEMBL1160488",
          "CHEMBL1160492",
          "CHEMBL1160499",
          "CHEMBL1160500",
          "CHEMBL1160501",
          "CHEMBL12",
          "CHEMBL13095",
          "CHEMBL13280",
          "CHEMBL146206",
          "CHEMBL171531",
          "CHEMBL171651",
          "CHEMBL1907660",
          "CHEMBL1907661",
          "CHEMBL1907662",
          "CHEMBL1907663",
          "CHEMBL1907665",
          "CHEMBL1907666",
          "CHEMBL1907667",
          "CHEMBL1907838",
          "CHEMBL1907839",
          "CHEMBL1907840",
          "CHEMBL1907841",
          "CHEMBL1907842",
          "CHEMBL1907843",
          "CHEMBL1907844",
          "CHEMBL1907845",
          "CHEMBL1907846",
          "CHEMBL1907847",
          "CHEMBL1907848",
          "CHEMBL1907849",
          "CHEMBL1907850",
          "CHEMBL1907851",
          "CHEMBL1907852",
          "CHEMBL1907853",
          "CHEMBL1907854",
          "CHEMBL1907855",
          "CHEMBL1907856",
          "CHEMBL201232",
          "CHEMBL2092865",
          "CHEMBL2092866",
          "CHEMBL2092867",
          "CHEMBL2092868",
          "CHEMBL2092869",
          "CHEMBL2092870",
          "CHEMBL2092871",
          "CHEMBL209821",
          "CHEMBL2114102",
          "CHEMBL217236",
          "CHEMBL217609",
          "CHEMBL2310856",
          "CHEMBL2310857",
          "CHEMBL262483",
          "CHEMBL263742",
          "CHEMBL266839",
          "CHEMBL269016",
          "CHEMBL269185",
          "CHEMBL269355",
          "CHEMBL289284",
          "CHEMBL289744",
          "CHEMBL290034",
          "CHEMBL290142",
          "CHEMBL290143",
          "CHEMBL290936",
          "CHEMBL293744",
          "CHEMBL301427",
          "CHEMBL302282",
          "CHEMBL302359",
          "CHEMBL302825",
          "CHEMBL303227",
          "CHEMBL303386",
          "CHEMBL303724",
          "CHEMBL304768",
          "CHEMBL305951",
          "CHEMBL306271",
          "CHEMBL306369",
          "CHEMBL306394",
          "CHEMBL306396",
          "CHEMBL306760",
          "CHEMBL306806",
          "CHEMBL306958",
          "CHEMBL307034",
          "CHEMBL307370",
          "CHEMBL307659",
          "CHEMBL307661",
          "CHEMBL307878",
          "CHEMBL308111",
          "CHEMBL308297",
          "CHEMBL308404",
          "CHEMBL308414",
          "CHEMBL308756",
          "CHEMBL308769",
          "CHEMBL309017",
          "CHEMBL309575",
          "CHEMBL310246",
          "CHEMBL310250",
          "CHEMBL314081",
          "CHEMBL314579",
          "CHEMBL315184",
          "CHEMBL315358",
          "CHEMBL316190",
          "CHEMBL316238",
          "CHEMBL316944",
          "CHEMBL316949",
          "CHEMBL318010",
          "CHEMBL321761",
          "CHEMBL329552",
          "CHEMBL346160",
          "CHEMBL357983",
          "CHEMBL384035",
          "CHEMBL386682",
          "CHEMBL39263",
          "CHEMBL40211",
          "CHEMBL405243",
          "CHEMBL40668",
          "CHEMBL409529",
          "CHEMBL410965",
          "CHEMBL411466",
          "CHEMBL412238",
          "CHEMBL412863",
          "CHEMBL414592",
          "CHEMBL414793",
          "CHEMBL419764",
          "CHEMBL419997",
          "CHEMBL421778",
          "CHEMBL422411",
          "CHEMBL422951",
          "CHEMBL423869",
          "CHEMBL431185",
          "CHEMBL432293",
          "CHEMBL432334",
          "CHEMBL432511",
          "CHEMBL432864",
          "CHEMBL433498",
          "CHEMBL438912",
          "CHEMBL439591",
          "CHEMBL441445",
          "CHEMBL443009",
          "CHEMBL451",
          "CHEMBL452",
          "CHEMBL57915",
          "CHEMBL70259",
          "CHEMBL70361",
          "CHEMBL70405",
          "CHEMBL70456",
          "CHEMBL70499",
          "CHEMBL70549",
          "CHEMBL70550",
          "CHEMBL70593",
          "CHEMBL70728",
          "CHEMBL70856",
          "CHEMBL70883",
          "CHEMBL70896",
          "CHEMBL71079",
          "CHEMBL71950",
          "CHEMBL72057",
          "CHEMBL72073",
          "CHEMBL72151",
          "CHEMBL72300",
          "CHEMBL72428",
          "CHEMBL72491",
          "CHEMBL72526",
          "CHEMBL72546",
          "CHEMBL72550",
          "CHEMBL72570",
          "CHEMBL72599",
          "CHEMBL72616",
          "CHEMBL72667",
          "CHEMBL72670",
          "CHEMBL72710",
          "CHEMBL72727",
          "CHEMBL72738",
          "CHEMBL72841",
          "CHEMBL72894",
          "CHEMBL73096",
          "CHEMBL73110",
          "CHEMBL73272",
          "CHEMBL73510",
          "CHEMBL73522",
          "CHEMBL73535",
          "CHEMBL73561",
          "CHEMBL73563",
          "CHEMBL73621",
          "CHEMBL73745",
          "CHEMBL73885",
          "CHEMBL73892",
          "CHEMBL73946",
          "CHEMBL74066",
          "CHEMBL74125",
          "CHEMBL74170",
          "CHEMBL74181",
          "CHEMBL74515",
          "CHEMBL74580",
          "CHEMBL9506",
          "CHEMBL98631",
          "CHEMBL98720",
          "CHEMBL99499"
        ],
        "number_of_missing_values": "0"
      },
      {
        "data_type": "numeric",
        "index": "1",
        "is_ignore": "false",
        "is_row_identifier": "false",
        "is_target": "false",
        "name": "FCFP4_1024b52",
        "number_of_missing_values": "0"
      },
      {
        "data_type": "numeric",
        "index": "2",
        "is_ignore": "false",
        "is_row_identifier": "false",
        "is_target": "false",
        "name": "FCFP4_1024b765",
        "number_of_missing_values": "0"
      },
      {
        "data_type": "numeric",
        "index": "3",
        "is_ignore": "false",
        "is_row_identifier": "false",
        "is_target": "false",
        "name": "FCFP4_1024b541",
        "number_of_missing_values": "0"
      },
      {
        "data_type": "numeric",
        "index": "4",
        "is_ignore": "false",
        "is_row_identifier": "false",
        "is_target": "false",
        "name": "FCFP4_1024b799",
        "number_of_missing_values": "0"
      },
      {
        "data_type": "numeric",
        "index": "5",
        "is_ignore": "false",
        "is_row_identifier": "false",
        "is_target": "false",
        "name": "FCFP4_1024b728",
        "number_of_missing_values": "0"
      },
      {
        "data_type": "numeric",
        "index": "6",
        "is_ignore": "false",
        "is_row_identifier": "false",
        "is_target": "false",
        "name": "FCFP4_1024b483",
        "number_of_missing_values": "0"
      },
      {
        "data_type": "numeric",
        "index": "7",
        "is_ignore": "false",
        "is_row_identifier": "false",
        "is_target": "false",
        "name": "FCFP4_1024b360",
        "number_of_missing_values": "0"
      },
      {
        "data_type": "numeric",
        "index": "8",
        "is_ignore": "false",
        "is_row_identifier": "false",
        "is_target": "false",
        "name": "FCFP4_1024b668",
        "number_of_missing_values": "0"
      },
      {
        "data_type": "numeric",
        "index": "9",
        "is_ignore": "false",
        "is_row_identifier": "false",
        "is_target": "false",
        "name": "FCFP4_1024b271",
        "number_of_missing_values": "0"
      },
      {
        "data_type": "numeric",
        "index": "10",
        "is_ignore": "false",
        "is_row_identifier": "false",
        "is_target": "false",
        "name": "FCFP4_1024b922",
        "number_of_missing_values": "0"
      },
      {
        "data_type": "numeric",
        "index": "11",
        "is_ignore": "false",
        "is_row_identifier": "false",
        "is_target": "false",
        "name": "FCFP4_1024b8",
        "number_of_missing_values": "0"
      },
      {
        "data_type": "numeric",
        "index": "12",
        "is_ignore": "false",
        "is_row_identifier": "false",
        "is_target": "false",
        "name": "FCFP4_1024b614",
        "number_of_missing_values": "0"
      },
      {
        "data_type": "numeric",
        "index": "13",
        "is_ignore": "false",
        "is_row_identifier": "false",
        "is_target": "false",
        "name": "FCFP4_1024b650",
        "number_of_missing_values": "0"
      },
      {
        "data_type": "numeric",
        "index": "14",
        "is_ignore": "false",
        "is_row_identifier": "false",
        "is_target": "false",
        "name": "FCFP4_1024b923",
        "number_of_missing_values": "0"
      },
      {
        "data_type": "numeric",
        "index": "15",
        "is_ignore": "false",
        "is_row_identifier": "false",
        "is_target": "false",
        "name": "FCFP4_1024b943",
        "number_of_missing_values": "0"
      },
      {
        "data_type": "numeric",
        "index": "16",
        "is_ignore": "false",
        "is_row_identifier": "false",
        "is_target": "false",
        "name": "FCFP4_1024b714",
        "number_of_missing_values": "0"
      },
      {
        "data_type": "numeric",
        "index": "17",
        "is_ignore": "false",
        "is_row_identifier": "false",
        "is_target": "false",
        "name": "FCFP4_1024b455",
        "number_of_missing_values": "0"
      },
      {
        "data_type": "numeric",
        "index": "18",
        "is_ignore": "false",
        "is_row_identifier": "false",
        "is_target": "false",
        "name": "FCFP4_1024b752",
        "number_of_missing_values": "0"
      },
      {
        "data_type": "numeric",
        "index": "19",
        "is_ignore": "false",
        "is_row_identifier": "false",
        "is_target": "false",
        "name": "FCFP4_1024b574",
        "number_of_missing_values": "0"
      },
      {
        "data_type": "numeric",
        "index": "20",
        "is_ignore": "false",
        "is_row_identifier": "false",
        "is_target": "false",
        "name": "FCFP4_1024b151",
        "number_of_missing_values": "0"
      },
      {
        "data_type": "numeric",
        "index": "21",
        "is_ignore": "false",
        "is_row_identifier": "false",
        "is_target": "false",
        "name": "FCFP4_1024b374",
        "number_of_missing_values": "0"
      },
      {
        "data_type": "numeric",
        "index": "22",
        "is_ignore": "false",
        "is_row_identifier": "false",
        "is_target": "false",
        "name": "FCFP4_1024b265",
        "number_of_missing_values": "0"
      },
      {
        "data_type": "numeric",
        "index": "23",
        "is_ignore": "false",
        "is_row_identifier": "false",
        "is_target": "false",
        "name": "FCFP4_1024b492",
        "number_of_missing_values": "0"
      },
      {
        "data_type": "numeric",
        "index": "24",
        "is_ignore": "false",
        "is_row_identifier": "false",
        "is_target": "false",
        "name": "FCFP4_1024b429",
        "number_of_missing_values": "0"
      },
      {
        "data_type": "numeric",
        "index": "25",
        "is_ignore": "false",
        "is_row_identifier": "false",
        "is_target": "false",
        "name": "FCFP4_1024b208",
        "number_of_missing_values": "0"
      },
      {
        "data_type": "numeric",
        "index": "26",
        "is_ignore": "false",
        "is_row_identifier": "false",
        "is_target": "false",
        "name": "FCFP4_1024b365",
        "number_of_missing_values": "0"
      },
      {
        "data_type": "numeric",
        "index": "27",
        "is_ignore": "false",
        "is_row_identifier": "false",
        "is_target": "false",
        "name": "FCFP4_1024b114",
        "number_of_missing_values": "0"
      },
      {
        "data_type": "numeric",
        "index": "28",
        "is_ignore": "false",
        "is_row_identifier": "false",
        "is_target": "false",
        "name": "FCFP4_1024b599",
        "number_of_missing_values": "0"
      },
      {
        "data_type": "numeric",
        "index": "29",
        "is_ignore": "false",
        "is_row_identifier": "false",
        "is_target": "false",
        "name": "FCFP4_1024b615",
        "number_of_missing_values": "0"
      },
      {
        "data_type": "numeric",
        "index": "30",
        "is_ignore": "false",
        "is_row_identifier": "false",
        "is_target": "false",
        "name": "FCFP4_1024b18",
        "number_of_missing_values": "0"
      },
      {
        "data_type": "numeric",
        "index": "31",
        "is_ignore": "false",
        "is_row_identifier": "false",
        "is_target": "false",
        "name": "FCFP4_1024b937",
        "number_of_missing_values": "0"
      },
      {
        "data_type": "numeric",
        "index": "32",
        "is_ignore": "false",
        "is_row_identifier": "false",
        "is_target": "false",
        "name": "FCFP4_1024b847",
        "number_of_missing_values": "0"
      },
      {
        "data_type": "numeric",
        "index": "33",
        "is_ignore": "false",
        "is_row_identifier": "false",
        "is_target": "false",
        "name": "FCFP4_1024b859",
        "number_of_missing_values": "0"
      },
      {
        "data_type": "numeric",
        "index": "34",
        "is_ignore": "false",
        "is_row_identifier": "false",
        "is_target": "false",
        "name": "FCFP4_1024b612",
        "number_of_missing_values": "0"
      },
      {
        "data_type": "numeric",
        "index": "35",
        "is_ignore": "false",
        "is_row_identifier": "false",
        "is_target": "false",
        "name": "FCFP4_1024b626",
        "number_of_missing_values": "0"
      },
      {
        "data_type": "numeric",
        "index": "36",
        "is_ignore": "false",
        "is_row_identifier": "false",
        "is_target": "false",
        "name": "FCFP4_1024b78",
        "number_of_missing_values": "0"
      },
      {
        "data_type": "numeric",
        "index": "37",
        "is_ignore": "false",
        "is_row_identifier": "false",
        "is_target": "false",
        "name": "FCFP4_1024b123",
        "number_of_missing_values": "0"
      },
      {
        "data_type": "numeric",
        "index": "38",
        "is_ignore": "false",
        "is_row_identifier": "false",
        "is_target": "false",
        "name": "FCFP4_1024b20",
        "number_of_missing_values": "0"
      },
      {
        "data_type": "numeric",
        "index": "39",
        "is_ignore": "false",
        "is_row_identifier": "false",
        "is_target": "false",
        "name": "FCFP4_1024b908",
        "number_of_missing_values": "0"
      },
      {
        "data_type": "numeric",
        "index": "40",
        "is_ignore": "false",
        "is_row_identifier": "false",
        "is_target": "false",
        "name": "FCFP4_1024b199",
        "number_of_missing_values": "0"
      },
      {
        "data_type": "numeric",
        "index": "41",
        "is_ignore": "false",
        "is_row_identifier": "false",
        "is_target": "false",
        "name": "FCFP4_1024b680",
        "number_of_missing_values": "0"
      },
      {
        "data_type": "numeric",
        "index": "42",
        "is_ignore": "false",
        "is_row_identifier": "false",
        "is_target": "false",
        "name": "FCFP4_1024b983",
        "number_of_missing_values": "0"
      },
      {
        "data_type": "numeric",
        "index": "43",
        "is_ignore": "false",
        "is_row_identifier": "false",
        "is_target": "false",
        "name": "FCFP4_1024b33",
        "number_of_missing_values": "0"
      },
      {
        "data_type": "numeric",
        "index": "44",
        "is_ignore": "false",
        "is_row_identifier": "false",
        "is_target": "false",
        "name": "FCFP4_1024b333",
        "number_of_missing_values": "0"
      },
      {
        "data_type": "numeric",
        "index": "45",
        "is_ignore": "false",
        "is_row_identifier": "false",
        "is_target": "false",
        "name": "FCFP4_1024b774",
        "number_of_missing_values": "0"
      },
      {
        "data_type": "numeric",
        "index": "46",
        "is_ignore": "false",
        "is_row_identifier": "false",
        "is_target": "false",
        "name": "FCFP4_1024b37",
        "number_of_missing_values": "0"
      },
      {
        "data_type": "numeric",
        "index": "47",
        "is_ignore": "false",
        "is_row_identifier": "false",
        "is_target": "false",
        "name": "FCFP4_1024b319",
        "number_of_missing_values": "0"
      },
      {
        "data_type": "numeric",
        "index": "48",
        "is_ignore": "false",
        "is_row_identifier": "false",
        "is_target": "false",
        "name": "FCFP4_1024b139",
        "number_of_missing_values": "0"
      },
      {
        "data_type": "numeric",
        "index": "49",
        "is_ignore": "false",
        "is_row_identifier": "false",
        "is_target": "false",
        "name": "FCFP4_1024b105",
        "number_of_missing_values": "0"
      },
      {
        "data_type": "numeric",
        "index": "50",
        "is_ignore": "false",
        "is_row_identifier": "false",
        "is_target": "false",
        "name": "FCFP4_1024b57",
        "number_of_missing_values": "0"
      },
      {
        "data_type": "numeric",
        "index": "51",
        "is_ignore": "false",
        "is_row_identifier": "false",
        "is_target": "false",
        "name": "FCFP4_1024b555",
        "number_of_missing_values": "0"
      },
      {
        "data_type": "numeric",
        "index": "52",
        "is_ignore": "false",
        "is_row_identifier": "false",
        "is_target": "true",
        "name": "pXC50",
        "number_of_missing_values": "0"
      }
    ]
  }
}