"molecule_id","AMW","C.","H.","Me","Mi","Mp","Mv","MW","N.","nAB","nAT","nB","nBM","nBO","nBR","nBT","nC","nCL","nCsp","nCsp2","nCsp3","nDB","nF","nH","nHet","nHM","nI","nN","nO","nP","nS","nSK","nTB","nX","O.","RBF","RBN","SCBO","Se","Si","Sp","Sv","X.","pXC50"
{1 7.809,2 43.6,3 41.8,4 1.008,5 1.125,6 0.677,7 0.654,8 429.52,9 9.1,10 22,11 55,13 24,14 35,16 58,17 24,20 20,21 4,22 2,24 23,25 8,28 5,29 3,32 32,35 5.5,36 0.086,37 5,38 48,39 55.443,40 61.857,41 37.245,42 35.993,44 7.276}
{0 CHEMBL1908842,1 6.979,2 39.4,3 48.5,4 0.996,5 1.133,6 0.649,7 0.612,8 460.64,9 9.1,10 11,11 66,13 15,14 37,16 69,17 26,19 1,20 13,21 12,22 3,24 32,25 8,28 6,29 2,32 34,33 1,35 3,36 0.087,37 6,38 47.5,39 65.752,40 74.806,41 42.841,42 40.406,44 8.585}
{0 CHEMBL2037208,1 8.882,2 49.1,3 34.5,4 1.028,5 1.13,6 0.702,7 0.698,8 488.5,9 7.3,10 23,11 55,13 26,14 40,16 59,17 27,20 26,21 1,22 3,23 3,24 19,25 9,28 4,29 2,32 36,34 3,35 3.6,36 0.085,37 5,38 54.5,39 56.552,40 62.168,41 38.597,42 38.406,43 5.5,44 6.509}
{0 CHEMBL2037209,1 8.748,2 47.7,3 35.4,4 1.025,5 1.132,6 0.698,7 0.692,8 568.6,9 9.2,10 28,11 65,13 31,14 47,16 70,17 31,20 29,21 2,22 3,23 3,24 23,25 11,28 6,29 2,32 42,34 3,35 3.1,36 0.086,37 6,38 64,39 66.64,40 73.58,41 45.37,42 44.976,43 4.6,44 5.377}
{0 CHEMBL2037211,1 8.148,2 44.4,3 40.3,4 1.018,5 1.136,6 0.676,7 0.661,8 586.67,9 8.3,10 23,11 72,13 26,14 48,16 77,17 32,20 26,21 6,22 3,23 3,24 29,25 11,28 6,29 2,32 43,34 3,35 2.8,36 0.078,37 6,38 62.5,39 73.29,40 81.825,41 48.654,42 47.556,43 4.2,44 5.432}
{0 CHEMBL2037220,1 8.409,2 44,3 38.7,4 1.026,5 1.137,6 0.674,7 0.666,8 630.68,9 8,10 23,11 75,13 27,14 51,16 80,17 33,20 27,21 6,22 4,23 3,24 29,25 13,28 6,29 4,32 46,34 3,35 5.3,36 0.088,37 7,38 66.5,39 76.945,40 85.244,41 50.563,42 49.986,43 4,44 5.119}
{0 CHEMBL2037224,1 8.834,2 47.4,3 35.1,4 1.029,5 1.134,6 0.695,7 0.692,8 503.52,9 8.8,10 23,11 57,13 26,14 41,16 61,17 27,20 26,21 1,22 3,23 3,24 20,25 10,28 5,29 2,32 37,34 3,35 3.5,36 0.082,37 5,38 55.5,39 58.654,40 64.666,41 39.603,42 39.428,43 5.3,44 5.469}
{0 CHEMBL2037226,1 8.926,2 46.7,3 35,4 1.034,5 1.14,6 0.688,7 0.689,8 535.54,9 8.3,10 23,11 60,13 26,14 43,16 64,17 28,20 26,21 2,22 3,23 4,24 21,25 11,28 5,29 2,32 39,34 4,35 3.3,36 0.078,37 5,38 57.5,39 62.05,40 68.421,41 41.301,42 41.338,43 6.7,44 5.398}
{0 CHEMBL2158221,1 7.085,2 41.5,3 47.2,4 0.994,5 1.129,6 0.662,7 0.624,8 375.52,9 9.4,10 11,11 53,13 14,14 31,16 56,17 22,19 1,20 12,21 9,22 2,24 25,25 6,28 5,29 1,32 28,33 1,35 1.9,36 0.071,37 4,38 40.5,39 52.672,40 59.853,41 35.097,42 33.09,44 8.143}
{0 CHEMBL2158223,1 7.143,2 41.7,3 46.7,4 0.994,5 1.129,6 0.664,7 0.627,8 428.59,9 10,10 11,11 60,13 15,14 35,16 63,17 25,19 2,20 12,21 11,22 2,24 28,25 7,28 6,29 1,32 32,33 2,35 1.7,36 0.095,37 6,38 46.5,39 59.658,40 67.766,41 39.864,42 37.638,44 7.959}
{0 CHEMBL2158224,1 7.179,2 43.1,3 46.2,4 0.993,5 1.126,6 0.671,7 0.633,8 466.64,9 9.2,10 17,11 65,13 20,14 39,16 69,17 28,19 1,20 17,21 10,22 2,24 30,25 7,28 6,29 1,32 35,33 1,35 1.5,36 0.087,37 6,38 51.5,39 64.541,40 73.182,41 43.625,42 41.165,44 8.31}
{0 CHEMBL2158225,1 6.993,2 40,3 48.3,4 0.996,5 1.132,6 0.651,7 0.614,8 419.58,9 8.3,10 11,11 60,13 14,14 34,16 63,17 24,19 1,20 12,21 11,22 2,24 29,25 7,28 5,29 2,32 31,33 1,35 3.3,36 0.095,37 6,38 43.5,39 59.767,40 67.893,41 39.074,42 36.858,44 8.328}
{0 CHEMBL2158226,1 7.025,2 39.1,3 48.4,4 1,5 1.133,6 0.645,7 0.611,8 449.61,9 7.8,10 11,11 64,13 14,14 36,16 67,17 25,19 1,20 12,21 12,22 2,24 31,25 8,28 5,29 3,32 33,33 1,35 4.7,36 0.104,37 7,38 45.5,39 63.978,40 72.517,41 41.29,42 39.1,44 7.678}
{0 CHEMBL2158227,1 7.41,2 38.5,3 47.7,4 1.001,5 1.13,6 0.661,7 0.62,8 481.68,9 7.7,10 11,11 65,13 16,14 37,16 68,17 25,19 1,20 12,21 12,22 4,24 31,25 9,26 1,28 5,29 3,31 1,32 34,33 1,35 4.6,36 0.103,37 7,38 48.5,39 65.054,40 73.437,41 42.938,42 40.287,44 8.509}
{0 CHEMBL2158228,1 7.21,2 40,3 46.7,4 1,5 1.133,6 0.655,7 0.623,8 432.58,9 10,10 11,11 60,13 15,14 35,16 63,17 24,19 1,20 13,21 10,22 3,24 28,25 8,28 6,29 2,32 32,33 1,35 3.3,36 0.095,37 6,38 45.5,39 59.985,40 67.976,41 39.319,42 37.353,44 7.959}
{0 CHEMBL2158229,1 7.348,2 40.7,3 45.8,4 1.004,5 1.13,6 0.657,7 0.628,8 433.56,9 8.5,10 11,11 59,13 15,14 35,16 62,17 24,19 1,20 13,21 10,22 3,24 27,25 8,28 5,29 3,32 32,33 1,35 5.1,36 0.097,37 6,38 45.5,39 59.211,40 66.687,41 38.767,42 37.046,44 6.301}
{0 CHEMBL2158230,1 6.787,2 38.9,3 50,4 0.993,5 1.134,6 0.644,7 0.604,8 488.7,9 8.3,10 11,11 72,13 14,14 40,16 76,17 28,19 1,20 12,21 15,22 2,24 36,25 8,28 6,29 2,32 36,33 1,35 2.8,36 0.092,37 7,38 49.5,39 71.519,40 81.637,41 46.364,42 43.46,44 8.495}
{0 CHEMBL2158231,1 7.51,2 43.8,3 43.8,4 1,5 1.125,6 0.677,7 0.646,8 480.62,9 9.4,10 17,11 64,13 21,14 40,16 68,17 28,19 1,20 18,21 9,22 3,24 28,25 8,28 6,29 2,32 36,33 1,35 3.1,36 0.074,37 5,38 53.5,39 63.985,40 71.976,41 43.319,42 41.353,44 8.357}
{0 CHEMBL2158287,1 7.359,2 39.7,3 46,4 1.007,5 1.132,6 0.651,7 0.624,8 463.59,9 7.9,10 11,11 63,13 15,14 37,16 66,17 25,19 1,20 13,21 11,22 3,24 29,25 9,28 5,29 4,32 34,33 1,35 6.3,36 0.091,37 6,38 47.5,39 63.421,40 71.312,41 40.983,42 39.288,44 8.638}
{0 CHEMBL2158288,1 7.114,2 38.8,3 47.8,4 1.001,5 1.135,6 0.646,7 0.614,8 476.64,9 9,10 11,11 67,13 15,14 38,16 70,17 26,19 1,20 13,21 12,22 3,24 32,25 9,28 6,29 3,32 35,33 1,35 4.5,36 0.114,37 8,38 48.5,39 67.08,40 76.016,41 43.296,42 41.121,44 8.357}
{0 CHEMBL2158289,1 7.01,2 38.6,3 48.6,4 0.999,5 1.135,6 0.644,7 0.609,8 490.67,9 8.6,10 11,11 70,13 15,14 39,16 73,17 27,19 1,20 13,21 13,22 3,24 34,25 9,28 6,29 3,32 36,33 1,35 4.3,36 0.11,37 8,38 49.5,39 69.963,40 79.431,41 45.057,42 42.648,44 9.194}
{0 CHEMBL2158290,1 7.745,2 39.1,3 45.3,4 1.008,5 1.129,6 0.666,7 0.632,8 495.66,9 7.8,10 11,11 64,13 17,14 38,16 67,17 25,19 1,20 13,21 11,22 5,24 29,25 10,26 1,28 5,29 4,31 1,32 35,33 1,35 6.3,36 0.09,37 6,38 50.5,39 64.498,40 72.232,41 42.631,42 40.475,44 8.167}
{0 CHEMBL2158291,1 7.64,2 43.1,3 43.1,4 1.005,5 1.126,6 0.673,7 0.647,8 496.62,9 9.2,10 17,11 65,13 22,14 41,16 69,17 28,19 1,20 18,21 9,22 4,24 28,25 9,28 6,29 3,32 37,33 1,35 4.6,36 0.072,37 5,38 55.5,39 65.312,40 73.185,41 43.773,42 42.068,44 8.022}
{0 CHEMBL2158292,1 7.64,2 43.1,3 43.1,4 1.005,5 1.126,6 0.673,7 0.647,8 496.62,9 9.2,10 17,11 65,13 22,14 41,16 69,17 28,19 1,20 18,21 9,22 4,24 28,25 9,28 6,29 3,32 37,33 1,35 4.6,36 0.072,37 5,38 55.5,39 65.312,40 73.185,41 43.773,42 42.068,44 7.745}
{0 CHEMBL2158293,1 7.44,2 41.5,3 44.6,4 1.001,5 1.13,6 0.667,7 0.637,8 483.63,9 10.8,10 16,11 65,13 20,14 40,16 69,17 27,19 1,20 16,21 10,22 3,24 29,25 9,28 7,29 2,32 36,33 1,35 3.1,36 0.087,37 6,38 53,39 65.087,40 73.474,41 43.324,42 41.374,44 7.31}
{0 CHEMBL2158294,1 7.319,2 41.2,3 45.6,4 1,5 1.131,6 0.663,7 0.631,8 497.66,9 10.3,10 16,11 68,13 20,14 41,16 72,17 28,19 1,20 16,21 11,22 3,24 31,25 9,28 7,29 2,32 37,33 1,35 2.9,36 0.083,37 6,38 54,39 67.97,40 76.889,41 45.086,42 42.901,44 7.638}
{0 CHEMBL2158295,1 7.383,2 43.3,3 44.8,4 0.998,5 1.125,6 0.673,7 0.64,8 494.65,9 9,10 17,11 67,13 21,14 41,16 71,17 29,19 1,20 18,21 10,22 3,24 30,25 8,28 6,29 2,32 37,33 1,35 3,36 0.085,37 6,38 54.5,39 66.869,40 75.391,41 45.08,42 42.88,44 7.886}
{0 CHEMBL2158296,1 7.383,2 43.3,3 44.8,4 0.998,5 1.125,6 0.673,7 0.64,8 494.65,9 9,10 17,11 67,13 21,14 41,16 71,17 29,19 1,20 18,21 10,22 3,24 30,25 8,28 6,29 2,32 37,33 1,35 3,36 0.085,37 6,38 54.5,39 66.869,40 75.391,41 45.08,42 42.88,44 8.509}
{0 CHEMBL2158297,1 7.383,2 43.3,3 44.8,4 0.998,5 1.125,6 0.673,7 0.64,8 494.65,9 9,10 17,11 67,13 21,14 41,16 71,17 29,19 1,20 18,21 10,22 3,24 30,25 8,28 6,29 2,32 37,33 1,35 3,36 0.085,37 6,38 54.5,39 66.869,40 75.391,41 45.08,42 42.88,44 8.328}
{0 CHEMBL2158298,1 6.983,2 39.2,3 48.6,4 0.998,5 1.133,6 0.646,7 0.61,8 516.71,9 8.1,10 11,11 74,13 15,14 42,16 78,17 29,19 1,20 13,21 15,22 3,24 36,25 9,28 6,29 3,32 38,33 1,35 4.1,36 0.09,37 7,38 52.5,39 73.847,40 83.846,41 47.819,42 45.175,44 8.495}
{0 CHEMBL2158299,1 7.08,2 39.4,3 47.9,4 0.999,5 1.133,6 0.649,7 0.615,8 502.68,9 8.5,10 11,11 71,13 15,14 41,16 75,17 28,19 1,20 13,21 14,22 3,24 34,25 9,28 6,29 3,32 37,33 1,35 4.2,36 0.08,37 6,38 51.5,39 70.963,40 80.431,41 46.057,42 43.648,44 8.194}
{0 CHEMBL2158300,1 6.879,2 39.1,3 49.3,4 0.995,5 1.134,6 0.646,7 0.608,8 474.67,9 8.7,10 11,11 69,13 15,14 38,16 72,17 27,19 1,20 13,21 13,22 3,24 34,25 8,28 6,29 2,32 35,33 1,35 2.9,36 0.083,37 6,38 48.5,39 68.636,40 78.221,41 44.603,42 41.933,44 7.658}
{0 CHEMBL2158301,1 6.979,2 39.4,3 48.5,4 0.996,5 1.133,6 0.649,7 0.612,8 460.64,9 9.1,10 11,11 66,13 15,14 37,16 69,17 26,19 1,20 13,21 12,22 3,24 32,25 8,28 6,29 2,32 34,33 1,35 3,36 0.072,37 5,38 47.5,39 65.752,40 74.806,41 42.841,42 40.406,44 8.398}
{0 CHEMBL2158302,1 7.228,2 39.1,3 46.9,4 1.003,5 1.134,6 0.649,7 0.619,8 462.61,9 9.4,10 11,11 64,13 15,14 37,16 67,17 25,19 1,20 13,21 11,22 3,24 30,25 9,28 6,29 3,32 34,33 1,35 4.7,36 0.09,37 6,38 47.5,39 64.196,40 72.6,41 41.534,42 39.594,44 7.886}
{0 CHEMBL2158303,1 7.343,2 40.4,3 45.6,4 1.002,5 1.133,6 0.659,7 0.629,8 418.55,9 10.5,10 11,11 57,13 15,14 34,16 60,17 23,19 1,20 13,21 9,22 3,24 26,25 8,28 6,29 2,32 31,33 1,35 3.5,36 0.067,37 4,38 44.5,39 57.101,40 64.561,41 37.557,42 35.826,44 7.602}
{0 CHEMBL2203426,1 7.01,2 38.6,3 48.6,4 0.999,5 1.135,6 0.644,7 0.609,8 490.67,9 8.6,10 17,11 70,13 19,14 39,16 73,17 27,20 16,21 11,22 2,24 34,25 9,28 6,29 3,32 36,35 4.3,36 0.096,37 7,38 49.5,39 69.963,40 79.431,41 45.057,42 42.648,44 7.432}
{0 CHEMBL2203427,1 6.914,2 38.4,3 49.3,4 0.998,5 1.135,6 0.641,7 0.605,8 504.7,9 8.2,10 17,11 73,13 19,14 40,16 76,17 28,20 16,21 12,22 2,24 36,25 9,28 6,29 3,32 37,35 4.1,36 0.105,37 8,38 50.5,39 72.847,40 82.846,41 46.819,42 44.175,44 7.171}
{0 CHEMBL2203428,1 7.126,2 37.7,3 47.8,4 1.003,5 1.138,6 0.642,7 0.611,8 491.66,9 10.1,10 17,11 69,13 19,14 39,16 72,17 26,20 16,21 10,22 2,24 33,25 10,28 7,29 3,32 36,35 4.3,36 0.097,37 7,38 49.5,39 69.181,40 78.514,41 44.302,42 42.143,44 6.963}
{0 CHEMBL2203429,1 7.567,2 40.4,3 44.2,4 1.009,5 1.132,6 0.659,7 0.634,8 393.49,9 9.6,10 17,11 52,13 19,14 31,16 54,17 21,20 16,21 5,22 2,24 23,25 8,28 5,29 3,32 29,35 5.8,36 0.093,37 5,38 41.5,39 52.443,40 58.857,41 34.245,42 32.993,44 7.194}
{0 CHEMBL2203430,1 7.567,2 40.4,3 44.2,4 1.009,5 1.132,6 0.659,7 0.634,8 393.49,9 9.6,10 17,11 52,13 19,14 31,16 54,17 21,20 16,21 5,22 2,24 23,25 8,28 5,29 3,32 29,35 5.8,36 0.093,37 5,38 41.5,39 52.443,40 58.857,41 34.245,42 32.993,44 6.652}
{0 CHEMBL2203431,1 7.363,2 38.5,3 46.2,4 1.008,5 1.136,6 0.646,7 0.62,8 478.61,9 9.2,10 17,11 65,13 19,14 38,16 68,17 25,20 16,21 9,22 2,24 30,25 10,28 6,29 4,32 35,35 6.2,36 0.103,37 7,38 48.5,39 65.523,40 73.81,41 41.989,42 40.309,44 6.839}
{0 CHEMBL2203432,1 7.136,2 38,3 47.9,4 1.004,5 1.136,6 0.641,7 0.611,8 506.67,9 8.5,10 17,11 71,13 19,14 40,16 74,17 27,20 16,21 11,22 2,24 34,25 10,28 6,29 4,32 37,35 5.6,36 0.108,37 8,38 50.5,39 71.29,40 80.64,41 45.512,42 43.363,44 6.529}
{0 CHEMBL2203433,1 7.363,2 38.5,3 46.2,4 1.008,5 1.136,6 0.646,7 0.62,8 478.61,9 9.2,10 17,11 65,13 19,14 38,16 68,17 25,20 16,21 9,22 2,24 30,25 10,28 6,29 4,32 35,35 6.2,36 0.103,37 7,38 48.5,39 65.523,40 73.81,41 41.989,42 40.309,44 7.447}
{0 CHEMBL2203434,1 7.136,2 38,3 47.9,4 1.004,5 1.136,6 0.641,7 0.611,8 506.67,9 8.5,10 17,11 71,13 19,14 40,16 74,17 27,20 16,21 11,22 2,24 34,25 10,28 6,29 4,32 37,35 5.6,36 0.108,37 8,38 50.5,39 71.29,40 80.64,41 45.512,42 43.363,44 7.387}
{0 CHEMBL2203435,1 7.036,2 37.8,3 48.6,4 1.002,5 1.136,6 0.639,7 0.607,8 520.7,9 8.1,10 17,11 74,13 19,14 41,16 77,17 28,20 16,21 12,22 2,24 36,25 10,28 6,29 4,32 38,35 5.4,36 0.104,37 8,38 51.5,39 74.174,40 84.055,41 47.273,42 44.89,44 7.108}
{0 CHEMBL2203436,1 7.896,2 38,3 43.7,4 1.026,5 1.15,6 0.638,7 0.627,8 560.64,9 8.5,10 17,11 71,13 19,14 43,16 74,17 27,20 16,21 11,22 2,23 3,24 31,25 13,28 6,29 4,32 40,34 3,35 5.6,36 0.108,37 8,38 53.5,39 72.829,40 81.659,41 45.324,42 44.513,43 4.2,44 6.772}
{0 CHEMBL2203437,1 6.945,2 37.7,3 49.4,4 1.001,5 1.136,6 0.637,7 0.603,8 534.73,9 7.8,10 17,11 77,13 19,14 42,16 80,17 29,20 16,21 13,22 2,24 38,25 10,28 6,29 4,32 39,35 5.2,36 0.1,37 8,38 52.5,39 77.058,40 87.471,41 49.035,42 46.416,44 7.191}
{0 CHEMBL2203438,1 7.204,2 38.9,3 47.2,4 1.004,5 1.134,6 0.646,7 0.616,8 518.68,9 8.3,10 17,11 72,13 19,14 42,16 76,17 28,20 16,21 12,22 2,24 34,25 10,28 6,29 4,32 38,35 5.6,36 0.105,37 8,38 52.5,39 72.29,40 81.64,41 46.512,42 44.363,44 6.824}
{0 CHEMBL2206277,1 6.859,2 37.5,3 50,4 0.999,5 1.136,6 0.635,7 0.599,8 548.76,9 7.5,10 17,11 80,13 19,14 43,16 83,17 30,20 16,21 14,22 2,24 40,25 10,28 6,29 4,32 40,35 5,36 0.084,37 7,38 53.5,39 79.941,40 90.886,41 50.796,42 47.943,44 7.298}
{0 CHEMBL2206278,1 6.781,2 37.3,3 50.6,4 0.998,5 1.136,6 0.633,7 0.596,8 562.79,9 7.2,10 17,11 83,13 19,14 44,16 86,17 31,20 16,21 15,22 2,24 42,25 10,28 6,29 4,32 41,35 4.8,36 0.093,37 8,38 54.5,39 82.825,40 94.301,41 52.557,42 49.47,44 7.334}
{0 CHEMBL2206279,1 6.945,2 37.7,3 49.4,4 1.001,5 1.136,6 0.637,7 0.603,8 534.73,9 7.8,10 17,11 77,13 19,14 42,16 80,17 29,20 16,21 13,22 2,24 38,25 10,28 6,29 4,32 39,35 5.2,36 0.088,37 7,38 52.5,39 77.058,40 87.471,41 49.035,42 46.416,44 7.127}
{0 CHEMBL256712,1 7.199,2 41.4,3 46.6,4 0.998,5 1.129,6 0.661,7 0.626,8 417.56,9 8.6,10 11,11 58,13 15,14 34,16 61,17 24,19 1,20 13,21 10,22 3,24 27,25 7,28 5,29 2,32 31,33 1,35 3.4,36 0.066,37 4,38 44.5,39 57.883,40 65.478,41 38.313,42 36.331,44 8.252}
{0 CHEMBL403776,1 7.274,2 41.7,3 45.8,4 0.998,5 1.129,6 0.665,7 0.631,8 523.7,9 9.7,10 18,11 72,13 21,14 44,16 77,17 30,20 20,21 10,22 3,24 33,25 9,28 7,29 2,32 39,35 2.8,36 0.091,37 7,38 56,39 71.854,40 81.305,41 47.847,42 45.428,44 8.046}
{0 CHEMBL414001,1 7.51,2 42.4,3 43.9,4 1.001,5 1.128,6 0.672,7 0.642,8 495.64,9 10.6,10 18,11 66,13 21,14 42,16 71,17 28,20 20,21 8,22 3,24 29,25 9,28 7,29 2,32 37,35 3,36 0.07,37 5,38 54,39 66.087,40 74.474,41 44.324,42 42.374,44 7.796}
{0 CHEMBL444454,1 8.358,2 40.6,3 40.6,4 1.02,5 1.127,6 0.678,7 0.658,8 576.69,9 8.7,10 18,11 69,13 24,14 45,16 73,17 28,20 21,21 7,22 6,24 28,25 13,26 1,28 6,29 6,31 1,32 41,35 8.7,36 0.123,37 9,38 60,39 70.371,40 77.733,41 46.784,42 45.399,44 7}
{0 CHEMBL445519,1 7.897,2 42.3,3 42.3,4 1.016,5 1.137,6 0.664,7 0.646,8 560.66,9 8.5,10 18,11 71,13 21,14 46,16 76,17 30,20 20,21 10,22 3,23 2,24 30,25 11,28 6,29 3,32 41,34 2,35 4.2,36 0.079,37 6,38 58,39 72.105,40 80.695,41 47.171,42 45.888,43 2.8,44 8.699}
{0 CHEMBL448117,1 7.69,2 41.7,3 43.1,4 1.009,5 1.129,6 0.667,7 0.643,8 553.68,9 9.7,10 18,11 72,13 22,14 46,16 77,17 30,20 21,21 9,22 4,24 31,25 11,28 7,29 4,32 41,35 5.6,36 0.104,37 8,38 59,39 72.625,40 81.308,41 47.995,42 46.331,44 8.678}
{0 CHEMBL448339,1 7.396,2 41.3,3 45.3,4 1.004,5 1.129,6 0.66,7 0.632,8 554.71,9 8,10 18,11 75,13 21,14 46,16 80,17 31,20 20,21 11,22 3,24 34,25 10,28 6,29 4,32 41,35 5.3,36 0.088,37 7,38 58,39 75.29,40 84.64,41 49.512,42 47.363,44 9.155}
{0 CHEMBL450914,1 7.509,2 40.5,3 44.6,4 1.007,5 1.131,6 0.659,7 0.633,8 555.7,9 9.5,10 18,11 74,13 21,14 46,16 79,17 30,20 19,21 11,22 3,24 33,25 11,28 7,29 4,32 41,35 5.4,36 0.089,37 7,38 58,39 74.509,40 83.723,41 48.756,42 46.857,44 6.886}
{0 CHEMBL451575,1 7.187,2 40.5,3 46.8,4 0.999,5 1.131,6 0.656,7 0.623,8 567.76,9 8.9,10 18,11 79,13 21,14 47,16 84,17 32,20 20,21 12,22 3,24 37,25 10,28 7,29 3,32 42,35 3.8,36 0.107,37 9,38 59,39 78.949,40 89.344,41 51.824,42 49.196,44 8.481}
{0 CHEMBL451918,1 7.187,2 40.5,3 46.8,4 0.999,5 1.131,6 0.656,7 0.623,8 567.76,9 8.9,10 18,11 79,13 21,14 47,16 84,17 32,20 20,21 12,22 3,24 37,25 10,28 7,29 3,32 42,35 3.8,36 0.107,37 9,38 59,39 78.949,40 89.344,41 51.824,42 49.196,44 7.252}
{0 CHEMBL451931,1 7.396,2 41.3,3 45.3,4 1.004,5 1.129,6 0.66,7 0.632,8 554.71,9 8,10 18,11 75,13 21,14 46,16 80,17 31,20 20,21 11,22 3,24 34,25 10,28 6,29 4,32 41,35 5.3,36 0.1,37 8,38 58,39 75.29,40 84.64,41 49.512,42 47.363,44 9}
{0 CHEMBL452965,1 7.685,2 41.9,3 43.2,4 1.01,5 1.127,6 0.665,7 0.643,8 568.69,9 8.1,10 18,11 74,13 22,14 47,16 79,17 31,20 21,21 10,22 4,24 32,25 11,28 6,29 5,32 42,35 6.8,36 0.101,37 8,38 60,39 74.734,40 83.434,41 49.205,42 47.551,44 7.638}
{0 CHEMBL455591,1 7.766,2 41.9,3 43.2,4 1.013,5 1.137,6 0.661,7 0.641,8 574.69,9 8.1,10 18,11 74,13 21,14 47,16 79,17 31,20 20,21 11,22 3,23 2,24 32,25 11,28 6,29 3,32 42,34 2,35 4.1,36 0.101,37 8,38 59,39 74.989,40 84.11,41 48.932,42 47.415,43 2.7,44 7.921}
{0 CHEMBL472403,1 7.39,2 42.3,3 45.1,4 1.001,5 1.127,6 0.666,7 0.636,8 524.68,9 8.5,10 18,11 71,13 21,14 44,16 76,17 30,20 20,21 10,22 3,24 32,25 9,28 6,29 3,32 39,35 4.2,36 0.092,37 7,38 56,39 71.08,40 80.016,41 47.296,42 45.121,44 7.26}
{0 CHEMBL489298,1 7.51,2 42.6,3 44.1,4 1.003,5 1.126,6 0.67,7 0.641,8 510.65,9 8.8,10 18,11 68,13 21,14 43,16 73,17 29,20 20,21 9,22 3,24 30,25 9,28 6,29 3,32 38,35 4.4,36 0.082,37 6,38 55,39 68.196,40 76.6,41 45.534,42 43.594,44 8.959}
{0 CHEMBL489684,1 7.324,2 41.4,3 45.7,4 1.001,5 1.129,6 0.661,7 0.63,8 512.67,9 8.6,10 18,11 70,13 21,14 42,16 74,17 29,20 20,21 9,22 3,24 32,25 9,28 6,29 3,32 38,35 4.3,36 0.095,37 7,38 54,39 70.08,40 79.016,41 46.296,42 44.121,44 9.222}
{0 CHEMBL489881,1 7.324,2 41.4,3 45.7,4 1.001,5 1.129,6 0.661,7 0.63,8 512.67,9 8.6,10 18,11 70,13 21,14 42,16 74,17 29,20 20,21 9,22 3,24 32,25 9,28 6,29 3,32 38,35 4.3,36 0.095,37 7,38 54,39 70.08,40 79.016,41 46.296,42 44.121,44 8.699}
{0 CHEMBL489883,1 7.01,2 38.6,3 48.6,4 0.999,5 1.135,6 0.644,7 0.609,8 490.67,9 8.6,10 12,11 70,13 15,14 40,16 74,17 27,20 14,21 13,22 3,24 34,25 9,28 6,29 3,32 36,35 4.3,36 0.081,37 6,38 49,39 69.963,40 79.431,41 45.057,42 42.648,44 8.602}
{0 CHEMBL490080,1 7.01,2 38.6,3 48.6,4 0.999,5 1.135,6 0.644,7 0.609,8 490.67,9 8.6,10 12,11 70,13 15,14 40,16 74,17 27,20 14,21 13,22 3,24 34,25 9,28 6,29 3,32 36,35 4.3,36 0.108,37 8,38 49,39 69.963,40 79.431,41 45.057,42 42.648,44 7.943}
{0 CHEMBL491078,1 8.188,2 42.9,3 39.3,4 1.018,5 1.128,6 0.678,7 0.664,8 458.52,9 10.7,10 18,11 56,13 21,14 38,16 60,17 24,20 19,21 5,22 3,24 22,25 10,28 6,29 4,32 34,35 7.1,36 0.1,37 6,38 50,39 56.989,40 63.149,41 37.943,42 37.202,44 7.076}
{0 CHEMBL492809,1 7.39,2 42.3,3 45.1,4 1.001,5 1.127,6 0.666,7 0.636,8 524.68,9 8.5,10 18,11 71,13 21,14 44,16 76,17 30,20 20,21 10,22 3,24 32,25 9,28 6,29 3,32 39,35 4.2,36 0.079,37 6,38 56,39 71.08,40 80.016,41 47.296,42 45.121,44 9.222}
{0 CHEMBL505830,1 7.286,2 40.8,3 46.1,4 1.001,5 1.131,6 0.659,7 0.627,8 553.73,9 9.2,10 18,11 76,13 21,14 46,16 81,17 31,20 20,21 11,22 3,24 35,25 10,28 7,29 3,32 41,35 3.9,36 0.099,37 8,38 58,39 76.065,40 85.929,41 50.063,42 47.669,44 8.886}
{0 CHEMBL507619,1 7.074,2 41,3 47.4,4 0.995,5 1.13,6 0.659,7 0.622,8 551.76,9 9,10 18,11 78,13 21,14 46,16 83,17 32,20 20,21 12,22 3,24 37,25 9,28 7,29 2,32 41,35 2.6,36 0.096,37 8,38 58,39 77.621,40 88.135,41 51.37,42 48.481,44 7.347}
{0 CHEMBL508935,1 7.569,2 41.3,3 44,4 1.007,5 1.13,6 0.663,7 0.638,8 567.71,9 9.3,10 18,11 75,13 22,14 47,16 80,17 31,20 21,21 10,22 4,24 33,25 11,28 7,29 4,32 42,35 5.3,36 0.1,37 8,38 60,39 75.509,40 84.723,41 49.756,42 47.857,44 8.62}
{0 CHEMBL509044,1 7.095,2 40.2,3 47.6,4 0.998,5 1.131,6 0.653,7 0.619,8 581.79,9 8.5,10 18,11 82,13 21,14 48,16 87,17 33,20 20,21 13,22 3,24 39,25 10,28 7,29 3,32 43,35 3.7,36 0.103,37 9,38 60,39 81.832,40 92.76,41 53.586,42 50.723,44 8.268}
{0 CHEMBL511484,1 7.17,2 41.3,3 46.7,4 0.997,5 1.13,6 0.661,7 0.626,8 537.73,9 9.3,10 18,11 75,13 21,14 45,16 80,17 31,20 20,21 11,22 3,24 35,25 9,28 7,29 2,32 40,35 2.7,36 0.088,37 7,38 57,39 74.738,40 84.72,41 49.608,42 46.955,44 7.585}
{0 CHEMBL514153,1 7.884,2 44.6,3 41.1,4 1.008,5 1.122,6 0.683,7 0.661,8 441.53,9 8.9,10 18,11 56,13 21,14 37,16 60,17 25,20 20,21 5,22 3,24 23,25 8,28 5,29 3,32 33,35 5.4,36 0.1,37 6,38 49,39 56.443,40 62.857,41 38.245,42 36.993,44 6.523}
{0 CHEMBL521580,1 6.825,2 38.2,3 50,4 0.996,5 1.135,6 0.639,7 0.601,8 518.73,9 7.9,10 12,11 76,13 15,14 42,16 80,17 29,20 14,21 15,22 3,24 38,25 9,28 6,29 3,32 38,35 3.9,36 0.075,37 6,38 51,39 75.73,40 86.261,41 48.58,42 45.702,44 9}
{0 CHEMBL522834,1 7.509,2 41.7,3 44.4,4 1.006,5 1.128,6 0.663,7 0.637,8 540.68,9 8.3,10 18,11 72,13 21,14 45,16 77,17 30,20 20,21 10,22 3,24 32,25 10,28 6,29 4,32 40,35 5.6,36 0.104,37 8,38 57,39 72.407,40 81.225,41 47.75,42 45.836,44 9.046}
{0 CHEMBL523802,1 7.409,2 40,3 45.5,4 1.006,5 1.132,6 0.655,7 0.628,8 407.52,9 9.1,10 12,11 55,13 15,14 33,16 58,17 22,20 14,21 8,22 3,24 25,25 8,28 5,29 3,32 30,35 5.5,36 0.121,37 7,38 42,39 55.327,40 62.272,41 36.006,42 34.519,44 6.523}
