"molecule_id","FCFP4_1024b197","FCFP4_1024b943","FCFP4_1024b104","FCFP4_1024b165","FCFP4_1024b191","FCFP4_1024b319","FCFP4_1024b370","FCFP4_1024b396","FCFP4_1024b398","FCFP4_1024b448","FCFP4_1024b48","FCFP4_1024b592","FCFP4_1024b681","FCFP4_1024b873","FCFP4_1024b891","FCFP4_1024b966","FCFP4_1024b152","FCFP4_1024b540","FCFP4_1024b714","FCFP4_1024b1001","FCFP4_1024b1020","FCFP4_1024b408","FCFP4_1024b436","FCFP4_1024b612","FCFP4_1024b679","FCFP4_1024b749","FCFP4_1024b858","FCFP4_1024b94","FCFP4_1024b1","FCFP4_1024b10","FCFP4_1024b100","FCFP4_1024b1000","FCFP4_1024b1002","FCFP4_1024b1003","FCFP4_1024b1004","FCFP4_1024b1005","FCFP4_1024b1006","FCFP4_1024b1007","FCFP4_1024b1008","FCFP4_1024b1009","FCFP4_1024b101","FCFP4_1024b1010","FCFP4_1024b1011","FCFP4_1024b1012","FCFP4_1024b1013","FCFP4_1024b1014","FCFP4_1024b1015","FCFP4_1024b1016","FCFP4_1024b1017","FCFP4_1024b1018","FCFP4_1024b1019","FCFP4_1024b102","FCFP4_1024b1021","FCFP4_1024b1022","FCFP4_1024b1023","FCFP4_1024b1024","FCFP4_1024b103","FCFP4_1024b105","FCFP4_1024b106","FCFP4_1024b107","FCFP4_1024b108","FCFP4_1024b109","FCFP4_1024b11","FCFP4_1024b110","FCFP4_1024b111","FCFP4_1024b112","FCFP4_1024b113","FCFP4_1024b114","FCFP4_1024b115","FCFP4_1024b116","FCFP4_1024b117","FCFP4_1024b118","FCFP4_1024b119","FCFP4_1024b12","FCFP4_1024b120","FCFP4_1024b121","FCFP4_1024b122","FCFP4_1024b123","FCFP4_1024b124","FCFP4_1024b125","FCFP4_1024b126","FCFP4_1024b127","FCFP4_1024b128","FCFP4_1024b129","FCFP4_1024b13","FCFP4_1024b130","FCFP4_1024b131","FCFP4_1024b132","FCFP4_1024b133","FCFP4_1024b134","FCFP4_1024b135","FCFP4_1024b136","FCFP4_1024b137","FCFP4_1024b138","FCFP4_1024b139","FCFP4_1024b14","FCFP4_1024b140","FCFP4_1024b141","FCFP4_1024b142","FCFP4_1024b143","FCFP4_1024b144","FCFP4_1024b145","FCFP4_1024b146","FCFP4_1024b147","FCFP4_1024b148","FCFP4_1024b149","FCFP4_1024b15","FCFP4_1024b150","FCFP4_1024b151","FCFP4_1024b153","FCFP4_1024b154","FCFP4_1024b155","FCFP4_1024b156","FCFP4_1024b157","FCFP4_1024b158","FCFP4_1024b159","FCFP4_1024b16","FCFP4_1024b160","FCFP4_1024b161","FCFP4_1024b162","FCFP4_1024b163","FCFP4_1024b164","FCFP4_1024b166","FCFP4_1024b167","FCFP4_1024b168","FCFP4_1024b169","FCFP4_1024b17","FCFP4_1024b170","FCFP4_1024b171","FCFP4_1024b172","FCFP4_1024b173","FCFP4_1024b174","FCFP4_1024b175","FCFP4_1024b176","FCFP4_1024b177","FCFP4_1024b178","FCFP4_1024b179","FCFP4_1024b18","FCFP4_1024b180","FCFP4_1024b181","FCFP4_1024b182","FCFP4_1024b183","FCFP4_1024b184","FCFP4_1024b185","FCFP4_1024b186","FCFP4_1024b187","FCFP4_1024b188","FCFP4_1024b189","FCFP4_1024b19","FCFP4_1024b190","FCFP4_1024b192","FCFP4_1024b193","FCFP4_1024b194","FCFP4_1024b195","FCFP4_1024b196","FCFP4_1024b198","FCFP4_1024b199","FCFP4_1024b2","FCFP4_1024b20","FCFP4_1024b200","FCFP4_1024b201","FCFP4_1024b202","FCFP4_1024b203","FCFP4_1024b204","FCFP4_1024b205","FCFP4_1024b206","FCFP4_1024b207","FCFP4_1024b208","FCFP4_1024b209","FCFP4_1024b21","FCFP4_1024b210","FCFP4_1024b211","FCFP4_1024b212","FCFP4_1024b213","FCFP4_1024b214","FCFP4_1024b215","FCFP4_1024b216","FCFP4_1024b217","FCFP4_1024b218","FCFP4_1024b219","FCFP4_1024b22","FCFP4_1024b220","FCFP4_1024b221","FCFP4_1024b222","FCFP4_1024b223","FCFP4_1024b224","FCFP4_1024b225","FCFP4_1024b226","FCFP4_1024b227","FCFP4_1024b228","FCFP4_1024b229","FCFP4_1024b23","FCFP4_1024b230","FCFP4_1024b231","FCFP4_1024b232","FCFP4_1024b233","FCFP4_1024b234","FCFP4_1024b235","FCFP4_1024b236","FCFP4_1024b237","FCFP4_1024b238","FCFP4_1024b239","FCFP4_1024b24","FCFP4_1024b240","FCFP4_1024b241","FCFP4_1024b242","FCFP4_1024b243","FCFP4_1024b244","FCFP4_1024b245","FCFP4_1024b246","FCFP4_1024b247","FCFP4_1024b248","FCFP4_1024b249","FCFP4_1024b25","FCFP4_1024b250","FCFP4_1024b251","FCFP4_1024b252","FCFP4_1024b253","FCFP4_1024b254","FCFP4_1024b255","FCFP4_1024b256","FCFP4_1024b257","FCFP4_1024b258","FCFP4_1024b259","FCFP4_1024b26","FCFP4_1024b260","FCFP4_1024b261","FCFP4_1024b262","FCFP4_1024b263","FCFP4_1024b264","FCFP4_1024b265","FCFP4_1024b266","FCFP4_1024b267","FCFP4_1024b268","FCFP4_1024b269","FCFP4_1024b27","FCFP4_1024b270","FCFP4_1024b271","FCFP4_1024b272","FCFP4_1024b273","FCFP4_1024b274","FCFP4_1024b275","FCFP4_1024b276","FCFP4_1024b277","FCFP4_1024b278","FCFP4_1024b279","FCFP4_1024b28","FCFP4_1024b280","FCFP4_1024b281","FCFP4_1024b282","FCFP4_1024b283","FCFP4_1024b284","FCFP4_1024b285","FCFP4_1024b286","FCFP4_1024b287","FCFP4_1024b288","pXC50"
{29 1,158 1,257 5.529}
{0 CHEMBL17154,29 1,158 1,257 5.317}
{0 CHEMBL17425,29 1,158 1,257 5.703}
{0 CHEMBL200117,29 1,65 1,67 1,127 1,128 1,138 1,158 1,211 1,214 1,238 1,257 6.658}
{0 CHEMBL201662,29 1,65 1,67 1,83 1,127 1,128 1,138 1,158 1,211 1,214 1,238 1,257 4.453}
{0 CHEMBL202197,29 1,65 1,67 1,127 1,128 1,138 1,158 1,211 1,214 1,238 1,257 5.886}
{0 CHEMBL259235,1 1,2 1,3 1,4 1,5 1,6 1,7 1,8 1,9 1,10 1,11 1,12 1,13 1,14 1,15 1,16 1,17 1,18 1,19 1,20 1,21 1,22 1,23 1,24 1,25 1,26 1,27 1,28 1,29 1,34 1,40 1,60 1,83 1,127 1,128 1,134 1,146 1,158 1,168 1,197 1,214 1,248 1,257 7.672}
{0 CHEMBL261094,1 1,2 1,3 1,4 1,5 1,6 1,7 1,8 1,9 1,10 1,11 1,12 1,13 1,14 1,15 1,16 1,17 1,18 1,19 1,20 1,21 1,22 1,23 1,24 1,25 1,26 1,27 1,28 1,29 1,34 1,60 1,127 1,128 1,158 1,214 1,249 1,251 1,257 7.488}
{0 CHEMBL261577,1 1,2 1,3 1,4 1,5 1,6 1,7 1,8 1,9 1,10 1,11 1,12 1,13 1,14 1,15 1,16 1,17 1,18 1,19 1,20 1,21 1,22 1,23 1,24 1,25 1,26 1,27 1,28 1,29 1,34 1,40 1,95 1,96 1,105 1,127 1,128 1,158 1,168 1,214 1,218 1,231 1,248 1,257 8.076}
{0 CHEMBL261583,1 1,2 1,3 1,4 1,5 1,6 1,7 1,8 1,9 1,10 1,11 1,12 1,13 1,14 1,15 1,16 1,17 1,18 1,19 1,20 1,21 1,22 1,23 1,24 1,25 1,26 1,27 1,28 1,29 1,34 1,40 1,60 1,83 1,127 1,128 1,134 1,146 1,158 1,168 1,197 1,214 1,248 1,257 7.304}
{0 CHEMBL278014,29 1,136 1,158 1,257 5.327}
{0 CHEMBL280487,18 1,19 1,20 1,22 1,23 1,24 1,25 1,27 1,28 1,29 1,58 1,138 1,145 1,158 1,188 1,257 5.301}
{0 CHEMBL405248,1 1,2 1,3 1,4 1,5 1,6 1,7 1,8 1,9 1,10 1,11 1,12 1,13 1,14 1,15 1,16 1,17 1,18 1,19 1,20 1,21 1,22 1,23 1,24 1,25 1,26 1,27 1,28 1,29 1,34 1,60 1,127 1,128 1,158 1,214 1,249 1,251 1,257 8.097}
{0 CHEMBL406220,1 1,2 1,3 1,4 1,5 1,6 1,7 1,8 1,9 1,10 1,11 1,12 1,13 1,14 1,15 1,16 1,18 1,19 1,20 1,22 1,23 1,24 1,25 1,27 1,28 1,29 1,158 1,257 8.347}
{0 CHEMBL406283,1 1,2 1,3 1,4 1,5 1,6 1,7 1,8 1,9 1,10 1,11 1,12 1,13 1,14 1,15 1,16 1,17 1,18 1,19 1,20 1,21 1,22 1,23 1,24 1,25 1,26 1,27 1,28 1,29 1,34 1,95 1,96 1,105 1,127 1,128 1,158 1,168 1,214 1,218 1,231 1,248 1,257 7.708}
{0 CHEMBL408120,1 1,2 1,3 1,4 1,5 1,6 1,7 1,8 1,9 1,10 1,11 1,12 1,13 1,14 1,15 1,16 1,17 1,18 1,19 1,20 1,21 1,22 1,23 1,24 1,25 1,26 1,27 1,28 1,29 1,34 1,77 1,95 1,96 1,105 1,127 1,128 1,158 1,168 1,214 1,218 1,231 1,248 1,257 8.469}
{0 CHEMBL427915,1 1,2 1,3 1,4 1,5 1,6 1,7 1,8 1,9 1,10 1,11 1,12 1,13 1,14 1,15 1,16 1,17 1,18 1,19 1,20 1,21 1,22 1,23 1,24 1,25 1,26 1,27 1,28 1,29 1,34 1,40 1,95 1,96 1,105 1,127 1,128 1,158 1,168 1,214 1,218 1,231 1,248 1,257 7.762}
{0 CHEMBL430266,1 1,2 1,11 1,14 1,17 1,18 1,19 1,26 1,29 1,30 1,38 1,62 1,77 1,99 1,110 1,112 1,127 1,138 1,141 1,143 1,158 1,159 1,168 1,183 1,245 1,254 1,256 1,257 6.301}
{0 CHEMBL436904,1 1,2 1,3 1,4 1,5 1,6 1,7 1,8 1,9 1,10 1,11 1,12 1,13 1,14 1,15 1,16 1,17 1,18 1,19 1,20 1,21 1,22 1,23 1,24 1,25 1,26 1,27 1,28 1,29 1,34 1,95 1,96 1,105 1,127 1,128 1,158 1,168 1,214 1,218 1,231 1,248 1,257 7.622}
{0 CHEMBL444092,1 1,2 1,17 1,18 1,19 1,21 1,29 1,50 1,62 1,127 1,128 1,158 1,161 1,175 1,188 1,199 1,214 1,257 7.456}
{0 CHEMBL48449,29 1,158 1,257 5.75}
