{
  "data_set_description": {
    "collection_date": "November 2013",
    "creator": "Dr Jeremy Besnard, Dr Ivan Olier, Dr Noureddin Sadawi, Dr Larisa Soldatova, Dr Crina Grosan, Prof Ross King, Dr Richard Bickerton, Prof Andrew Hopkins and Dr Willem van Hoorn",
    "default_target_attribute": "pXC50",
    "description": "This dataset contains QSAR data (from ChEMBL version 17) showing activity values (unit is pseudo-pCI50) of several compounds on drug target ChEMBL_ID: CHEMBL215 (TID: 55), and it has 1588 rows and 43 features (not including molecule IDs and class feature: molecule_id and pXC50). The features represent Basic Molecular Descriptors which were generated from SMILES strings.  Missing value imputation was applied to this dataset (By choosing the Median).",
    "description_version": "1",
    "file_id": "3259099",
    "format": "ARFF",
    "id": "25020",
    "licence": "Public",
    "md5_checksum": "c370971184837a96e064781475e57ea4",
    "minio_url": "https://data.openml.org/datasets/0002/25020/dataset_25020.pq",
    "name": "QSAR-DATASET-FOR-DRUG-TARGET-CHEMBL215",
    "original_data_url": "https://www.ebi.ac.uk/chembl/target/inspect/CHEMBL215",
    "parquet_url": "https://data.openml.org/datasets/0002/25020/dataset_25020.pq",
    "processing_date": "2018-10-03 23:03:57",
    "row_id_attribute": "molecule_id",
    "status": "deactivated",
    "tag": [
      "MetaQSAR",
      "study_13"
    ],
    "upload_date": "2016-07-14T15:57:01",
    "url": "https://api.openml.org/data/v1/download/3259099/QSAR-DATASET-FOR-DRUG-TARGET-CHEMBL215.arff",
    "version": "8",
    "visibility": "public"
  }
}