{
  "data_features": {
    "feature": [
      {
        "data_type": "nominal",
        "index": "0",
        "is_ignore": "false",
        "is_row_identifier": "true",
        "is_target": "false",
        "name": "molecule_id",
        "nominal_value": [
          "CHEMBL1076243",
          "CHEMBL1076259",
          "CHEMBL1076260",
          "CHEMBL1079119",
          "CHEMBL1079129",
          "CHEMBL1080274",
          "CHEMBL1080631",
          "CHEMBL1080813",
          "CHEMBL1080814",
          "CHEMBL1082081",
          "CHEMBL1082082",
          "CHEMBL1082605",
          "CHEMBL1082782",
          "CHEMBL1082783",
          "CHEMBL1082784",
          "CHEMBL1082785",
          "CHEMBL1082845",
          "CHEMBL1082846",
          "CHEMBL1082847",
          "CHEMBL1082849",
          "CHEMBL1082850",
          "CHEMBL1082977",
          "CHEMBL1082978",
          "CHEMBL1082979",
          "CHEMBL1082980",
          "CHEMBL1082981",
          "CHEMBL1083273",
          "CHEMBL1083431",
          "CHEMBL1083432",
          "CHEMBL1083710",
          "CHEMBL1083711",
          "CHEMBL1083972",
          "CHEMBL1083973",
          "CHEMBL1084080",
          "CHEMBL1084210",
          "CHEMBL1084211",
          "CHEMBL1084212",
          "CHEMBL1084213",
          "CHEMBL1084250",
          "CHEMBL1084517",
          "CHEMBL1084518",
          "CHEMBL1084519",
          "CHEMBL1084563",
          "CHEMBL1084650",
          "CHEMBL1084808",
          "CHEMBL1084831",
          "CHEMBL1084832",
          "CHEMBL1085505",
          "CHEMBL1085573",
          "CHEMBL1085574",
          "CHEMBL1085575",
          "CHEMBL1085576",
          "CHEMBL1085642",
          "CHEMBL1085643",
          "CHEMBL1085780",
          "CHEMBL1085781",
          "CHEMBL1085801",
          "CHEMBL1085869",
          "CHEMBL1085870",
          "CHEMBL1085871",
          "CHEMBL1086014",
          "CHEMBL1086036",
          "CHEMBL1086037",
          "CHEMBL1086100",
          "CHEMBL1086101",
          "CHEMBL1086102",
          "CHEMBL1086184",
          "CHEMBL1086464",
          "CHEMBL1087194",
          "CHEMBL1087458",
          "CHEMBL1087459",
          "CHEMBL1087968",
          "CHEMBL1088224",
          "CHEMBL1088352",
          "CHEMBL1088353",
          "CHEMBL1088354",
          "CHEMBL1088355",
          "CHEMBL1088377",
          "CHEMBL1088378",
          "CHEMBL1088654",
          "CHEMBL1088655",
          "CHEMBL1088656",
          "CHEMBL1088722",
          "CHEMBL1088723",
          "CHEMBL1094553",
          "CHEMBL1094554",
          "CHEMBL1094633",
          "CHEMBL1094972",
          "CHEMBL1095291",
          "CHEMBL1095603",
          "CHEMBL1095784",
          "CHEMBL1095960",
          "CHEMBL1096868",
          "CHEMBL1096869",
          "CHEMBL1096951",
          "CHEMBL1096952",
          "CHEMBL1096953",
          "CHEMBL1096994",
          "CHEMBL1097508",
          "CHEMBL1097509",
          "CHEMBL1097540",
          "CHEMBL1097825",
          "CHEMBL1097826",
          "CHEMBL1097951",
          "CHEMBL1097952",
          "CHEMBL1098295",
          "CHEMBL1098308",
          "CHEMBL1098309",
          "CHEMBL1098470",
          "CHEMBL1098471",
          "CHEMBL1099375",
          "CHEMBL1099376",
          "CHEMBL1099377",
          "CHEMBL1099378",
          "CHEMBL1099379",
          "CHEMBL1099380",
          "CHEMBL1099382",
          "CHEMBL1099383",
          "CHEMBL1099384",
          "CHEMBL1099385",
          "CHEMBL1099386",
          "CHEMBL1099387",
          "CHEMBL1099388",
          "CHEMBL1163253",
          "CHEMBL1163560",
          "CHEMBL1163817",
          "CHEMBL1163818",
          "CHEMBL1163829",
          "CHEMBL1163831",
          "CHEMBL1163907",
          "CHEMBL1163909",
          "CHEMBL1163985",
          "CHEMBL1163991",
          "CHEMBL1164074",
          "CHEMBL1164079",
          "CHEMBL1164080",
          "CHEMBL1164081",
          "CHEMBL1164137",
          "CHEMBL1164163",
          "CHEMBL1164169",
          "CHEMBL1164170",
          "CHEMBL1164250",
          "CHEMBL1164259",
          "CHEMBL1164261",
          "CHEMBL1164349",
          "CHEMBL1164683",
          "CHEMBL1165188",
          "CHEMBL1165190",
          "CHEMBL1165194",
          "CHEMBL1165272",
          "CHEMBL1165676",
          "CHEMBL1172618",
          "CHEMBL1172762",
          "CHEMBL1172817",
          "CHEMBL1173042",
          "CHEMBL1173052",
          "CHEMBL1173521",
          "CHEMBL1173662",
          "CHEMBL1173663",
          "CHEMBL1173761",
          "CHEMBL1201342",
          "CHEMBL1202342",
          "CHEMBL1206",
          "CHEMBL12089",
          "CHEMBL1214890",
          "CHEMBL1257131",
          "CHEMBL1512936",
          "CHEMBL152675",
          "CHEMBL1555",
          "CHEMBL156016",
          "CHEMBL1629774",
          "CHEMBL1629775",
          "CHEMBL1629776",
          "CHEMBL1629777",
          "CHEMBL1629779",
          "CHEMBL1629780",
          "CHEMBL1629781",
          "CHEMBL1629782",
          "CHEMBL1629784",
          "CHEMBL1629785",
          "CHEMBL1629786",
          "CHEMBL1629787",
          "CHEMBL1629790",
          "CHEMBL1629791",
          "CHEMBL1629792",
          "CHEMBL1629793",
          "CHEMBL1629794",
          "CHEMBL1629795",
          "CHEMBL1629796",
          "CHEMBL1629797",
          "CHEMBL1629798",
          "CHEMBL1629799",
          "CHEMBL1632336",
          "CHEMBL1644721",
          "CHEMBL1644722",
          "CHEMBL1644723",
          "CHEMBL1644724",
          "CHEMBL1644725",
          "CHEMBL1644726",
          "CHEMBL1644727",
          "CHEMBL1644728",
          "CHEMBL1644729",
          "CHEMBL1644730",
          "CHEMBL1644731",
          "CHEMBL1644818",
          "CHEMBL1651087",
          "CHEMBL1651089",
          "CHEMBL1651810",
          "CHEMBL1651811",
          "CHEMBL1651812",
          "CHEMBL1651813",
          "CHEMBL1651814",
          "CHEMBL1667881",
          "CHEMBL1669443",
          "CHEMBL1669444",
          "CHEMBL1669445",
          "CHEMBL1669446",
          "CHEMBL1669447",
          "CHEMBL1669448",
          "CHEMBL1669449",
          "CHEMBL1669450",
          "CHEMBL1669451",
          "CHEMBL1669452",
          "CHEMBL1669453",
          "CHEMBL1669454",
          "CHEMBL1669455",
          "CHEMBL1669456",
          "CHEMBL1669457",
          "CHEMBL1669458",
          "CHEMBL1669459",
          "CHEMBL1669460",
          "CHEMBL1669461",
          "CHEMBL1669462",
          "CHEMBL1669463",
          "CHEMBL1669464",
          "CHEMBL1677",
          "CHEMBL1678",
          "CHEMBL1762826",
          "CHEMBL1762827",
          "CHEMBL1762828",
          "CHEMBL1762829",
          "CHEMBL1762830",
          "CHEMBL1762831",
          "CHEMBL1762832",
          "CHEMBL1762833",
          "CHEMBL1762834",
          "CHEMBL1762835",
          "CHEMBL1766151",
          "CHEMBL1770152",
          "CHEMBL1770196",
          "CHEMBL1770197",
          "CHEMBL1770198",
          "CHEMBL1770199",
          "CHEMBL1770200",
          "CHEMBL1770201",
          "CHEMBL1770202",
          "CHEMBL1770203",
          "CHEMBL1770204",
          "CHEMBL1770205",
          "CHEMBL1770206",
          "CHEMBL1770207",
          "CHEMBL1770208",
          "CHEMBL1770209",
          "CHEMBL1782708",
          "CHEMBL1782709",
          "CHEMBL1782710",
          "CHEMBL1782711",
          "CHEMBL1782712",
          "CHEMBL1782713",
          "CHEMBL1782714",
          "CHEMBL1782715",
          "CHEMBL1782716",
          "CHEMBL1782717",
          "CHEMBL1782718",
          "CHEMBL1782719",
          "CHEMBL1782720",
          "CHEMBL1782721",
          "CHEMBL1782722",
          "CHEMBL1782723",
          "CHEMBL1782724",
          "CHEMBL1782725",
          "CHEMBL1782726",
          "CHEMBL1782727",
          "CHEMBL1782728",
          "CHEMBL1782729",
          "CHEMBL1782730",
          "CHEMBL1782731",
          "CHEMBL1782732",
          "CHEMBL1782733",
          "CHEMBL1782734",
          "CHEMBL1782735",
          "CHEMBL1782736",
          "CHEMBL1782737",
          "CHEMBL1782738",
          "CHEMBL1782739",
          "CHEMBL1782741",
          "CHEMBL1782742",
          "CHEMBL1782743",
          "CHEMBL1782744",
          "CHEMBL1782746",
          "CHEMBL1782747",
          "CHEMBL1782748",
          "CHEMBL1783190",
          "CHEMBL1783191",
          "CHEMBL1783192",
          "CHEMBL1783193",
          "CHEMBL1783194",
          "CHEMBL1783195",
          "CHEMBL1783237",
          "CHEMBL1783238",
          "CHEMBL1783239",
          "CHEMBL1783240",
          "CHEMBL1783241",
          "CHEMBL1783242",
          "CHEMBL1783243",
          "CHEMBL1797183",
          "CHEMBL1797184",
          "CHEMBL1797185",
          "CHEMBL1830622",
          "CHEMBL1830623",
          "CHEMBL1830624",
          "CHEMBL1830625",
          "CHEMBL1830626",
          "CHEMBL1830627",
          "CHEMBL1830628",
          "CHEMBL1830629",
          "CHEMBL1830630",
          "CHEMBL1830631",
          "CHEMBL1830632",
          "CHEMBL1830633",
          "CHEMBL1834060",
          "CHEMBL1834061",
          "CHEMBL1834062",
          "CHEMBL1834063",
          "CHEMBL1834064",
          "CHEMBL1834065",
          "CHEMBL1834066",
          "CHEMBL1834067",
          "CHEMBL1834068",
          "CHEMBL1834069",
          "CHEMBL1834070",
          "CHEMBL1834071",
          "CHEMBL1834072",
          "CHEMBL1834073",
          "CHEMBL1834074",
          "CHEMBL1834075",
          "CHEMBL1834076",
          "CHEMBL1834077",
          "CHEMBL1834078",
          "CHEMBL1834079",
          "CHEMBL1915190",
          "CHEMBL1915191",
          "CHEMBL1915192",
          "CHEMBL1915193",
          "CHEMBL1915194",
          "CHEMBL1915195",
          "CHEMBL1915196",
          "CHEMBL1915197",
          "CHEMBL1915198",
          "CHEMBL1915199",
          "CHEMBL1915200",
          "CHEMBL1915201",
          "CHEMBL1915202",
          "CHEMBL1915203",
          "CHEMBL1915204",
          "CHEMBL1915205",
          "CHEMBL1915206",
          "CHEMBL1915207",
          "CHEMBL1915208",
          "CHEMBL1915209",
          "CHEMBL1915210",
          "CHEMBL1915211",
          "CHEMBL1916766",
          "CHEMBL1916767",
          "CHEMBL1916768",
          "CHEMBL1916769",
          "CHEMBL1916770",
          "CHEMBL1916926",
          "CHEMBL1916927",
          "CHEMBL1916928",
          "CHEMBL1916929",
          "CHEMBL1916930",
          "CHEMBL1922541",
          "CHEMBL1926712",
          "CHEMBL1929418",
          "CHEMBL1929419",
          "CHEMBL1929420",
          "CHEMBL1929421",
          "CHEMBL1929422",
          "CHEMBL1929423",
          "CHEMBL1929424",
          "CHEMBL1938397",
          "CHEMBL1938451",
          "CHEMBL1938452",
          "CHEMBL1938453",
          "CHEMBL1938454",
          "CHEMBL1938455",
          "CHEMBL1938456",
          "CHEMBL1938457",
          "CHEMBL1938458",
          "CHEMBL1938459",
          "CHEMBL1938460",
          "CHEMBL1938461",
          "CHEMBL1938462",
          "CHEMBL1938463",
          "CHEMBL1938464",
          "CHEMBL1938465",
          "CHEMBL1938466",
          "CHEMBL1938467",
          "CHEMBL1956548",
          "CHEMBL1956549",
          "CHEMBL1956550",
          "CHEMBL1956551",
          "CHEMBL1956552",
          "CHEMBL1956553",
          "CHEMBL1956554",
          "CHEMBL1956555",
          "CHEMBL1956556",
          "CHEMBL1956557",
          "CHEMBL1956558",
          "CHEMBL1956559",
          "CHEMBL1956560",
          "CHEMBL2011194",
          "CHEMBL2011195",
          "CHEMBL2011196",
          "CHEMBL2011197",
          "CHEMBL2011198",
          "CHEMBL2011199",
          "CHEMBL2011200",
          "CHEMBL2011201",
          "CHEMBL2011202",
          "CHEMBL2011203",
          "CHEMBL2011204",
          "CHEMBL2011205",
          "CHEMBL2011206",
          "CHEMBL2011207",
          "CHEMBL2011208",
          "CHEMBL2011209",
          "CHEMBL2019027",
          "CHEMBL2019028",
          "CHEMBL2019029",
          "CHEMBL2019030",
          "CHEMBL2019031",
          "CHEMBL2019032",
          "CHEMBL2019033",
          "CHEMBL2019034",
          "CHEMBL2019035",
          "CHEMBL2019036",
          "CHEMBL2019037",
          "CHEMBL2019038",
          "CHEMBL2019039",
          "CHEMBL2019040",
          "CHEMBL2019041",
          "CHEMBL2019042",
          "CHEMBL2019043",
          "CHEMBL2019044",
          "CHEMBL2019045",
          "CHEMBL2019046",
          "CHEMBL2019047",
          "CHEMBL2019048",
          "CHEMBL2019049",
          "CHEMBL2019050",
          "CHEMBL2019051",
          "CHEMBL2019052",
          "CHEMBL2019053",
          "CHEMBL2019054",
          "CHEMBL2022040",
          "CHEMBL2022041",
          "CHEMBL2022042",
          "CHEMBL2022043",
          "CHEMBL2022044",
          "CHEMBL2022045",
          "CHEMBL2022046",
          "CHEMBL2022047",
          "CHEMBL2022048",
          "CHEMBL2022049",
          "CHEMBL2022050",
          "CHEMBL2024053",
          "CHEMBL2024054",
          "CHEMBL2024055",
          "CHEMBL2024056",
          "CHEMBL2024057",
          "CHEMBL2024058",
          "CHEMBL2024059",
          "CHEMBL2036258",
          "CHEMBL2036259",
          "CHEMBL2036260",
          "CHEMBL2036261",
          "CHEMBL2036262",
          "CHEMBL2036263",
          "CHEMBL2037380",
          "CHEMBL2037381",
          "CHEMBL2037382",
          "CHEMBL2037383",
          "CHEMBL2037384",
          "CHEMBL2037385",
          "CHEMBL2043044",
          "CHEMBL2043045",
          "CHEMBL2043046",
          "CHEMBL2043050",
          "CHEMBL2043052",
          "CHEMBL2043053",
          "CHEMBL2043054",
          "CHEMBL2043055",
          "CHEMBL2043056",
          "CHEMBL2043057",
          "CHEMBL2043058",
          "CHEMBL2043059",
          "CHEMBL2043060",
          "CHEMBL2043061",
          "CHEMBL2047223",
          "CHEMBL2047224",
          "CHEMBL2047225",
          "CHEMBL2047226",
          "CHEMBL2047227",
          "CHEMBL2047228",
          "CHEMBL2047229",
          "CHEMBL2047230",
          "CHEMBL2047231",
          "CHEMBL2047375",
          "CHEMBL2147355",
          "CHEMBL2147356",
          "CHEMBL2147357",
          "CHEMBL2147358",
          "CHEMBL2147359",
          "CHEMBL2147360",
          "CHEMBL2147361",
          "CHEMBL2147362",
          "CHEMBL2147363",
          "CHEMBL2147456",
          "CHEMBL2147457",
          "CHEMBL2147458",
          "CHEMBL2147459",
          "CHEMBL2147460",
          "CHEMBL2147461",
          "CHEMBL2147462",
          "CHEMBL2147463",
          "CHEMBL2147464",
          "CHEMBL2151784",
          "CHEMBL2151785",
          "CHEMBL2151786",
          "CHEMBL2151787",
          "CHEMBL2151788",
          "CHEMBL2151789",
          "CHEMBL2152537",
          "CHEMBL2152538",
          "CHEMBL2152539",
          "CHEMBL2152540",
          "CHEMBL2152541",
          "CHEMBL2152542",
          "CHEMBL2152543",
          "CHEMBL2152544",
          "CHEMBL2152545",
          "CHEMBL2152546",
          "CHEMBL2152547",
          "CHEMBL2152548",
          "CHEMBL2152549",
          "CHEMBL2152550",
          "CHEMBL2152551",
          "CHEMBL2152552",
          "CHEMBL2152553",
          "CHEMBL2152554",
          "CHEMBL2153022",
          "CHEMBL2153024",
          "CHEMBL2153030",
          "CHEMBL2153036",
          "CHEMBL21578",
          "CHEMBL2158110",
          "CHEMBL2158111",
          "CHEMBL2158112",
          "CHEMBL2158113",
          "CHEMBL2158114",
          "CHEMBL2158115",
          "CHEMBL2158116",
          "CHEMBL2158117",
          "CHEMBL2158118",
          "CHEMBL2158119",
          "CHEMBL2158120",
          "CHEMBL2158121",
          "CHEMBL2158122",
          "CHEMBL2158123",
          "CHEMBL2158124",
          "CHEMBL2158125",
          "CHEMBL2158126",
          "CHEMBL2158127",
          "CHEMBL2158128",
          "CHEMBL2163791",
          "CHEMBL2163792",
          "CHEMBL2163793",
          "CHEMBL2163794",
          "CHEMBL2165578",
          "CHEMBL2165597",
          "CHEMBL2169901",
          "CHEMBL2171308",
          "CHEMBL2171309",
          "CHEMBL2171311",
          "CHEMBL2171312",
          "CHEMBL2171313",
          "CHEMBL2171314",
          "CHEMBL2171315",
          "CHEMBL2171316",
          "CHEMBL2171317",
          "CHEMBL2171318",
          "CHEMBL2171319",
          "CHEMBL2171320",
          "CHEMBL2171321",
          "CHEMBL2171322",
          "CHEMBL2171323",
          "CHEMBL2171324",
          "CHEMBL2171325",
          "CHEMBL2171326",
          "CHEMBL2171327",
          "CHEMBL2171328",
          "CHEMBL2171329",
          "CHEMBL2171330",
          "CHEMBL2171331",
          "CHEMBL2171332",
          "CHEMBL2171333",
          "CHEMBL2171334",
          "CHEMBL2204447",
          "CHEMBL2204448",
          "CHEMBL2205573",
          "CHEMBL2205574",
          "CHEMBL2205575",
          "CHEMBL2205576",
          "CHEMBL2205577",
          "CHEMBL2206118",
          "CHEMBL2206119",
          "CHEMBL2206120",
          "CHEMBL2206121",
          "CHEMBL2206122",
          "CHEMBL2206123",
          "CHEMBL2206124",
          "CHEMBL2206125",
          "CHEMBL2206126",
          "CHEMBL2206127",
          "CHEMBL2206128",
          "CHEMBL2206129",
          "CHEMBL2206130",
          "CHEMBL2314721",
          "CHEMBL2314726",
          "CHEMBL2314727",
          "CHEMBL2314728",
          "CHEMBL2314731",
          "CHEMBL2323351",
          "CHEMBL2323352",
          "CHEMBL2323353",
          "CHEMBL2323354",
          "CHEMBL2323355",
          "CHEMBL2323356",
          "CHEMBL2332530",
          "CHEMBL2332531",
          "CHEMBL2332532",
          "CHEMBL2332533",
          "CHEMBL2332534",
          "CHEMBL2332535",
          "CHEMBL2332536",
          "CHEMBL2332537",
          "CHEMBL2332538",
          "CHEMBL2332539",
          "CHEMBL2332540",
          "CHEMBL2332541",
          "CHEMBL2332542",
          "CHEMBL2332543",
          "CHEMBL2332544",
          "CHEMBL2332545",
          "CHEMBL2332546",
          "CHEMBL2332547",
          "CHEMBL2332548",
          "CHEMBL2332549",
          "CHEMBL2332550",
          "CHEMBL2332974",
          "CHEMBL2332975",
          "CHEMBL2332976",
          "CHEMBL2332977",
          "CHEMBL2332978",
          "CHEMBL2332979",
          "CHEMBL2332980",
          "CHEMBL2332981",
          "CHEMBL2333925",
          "CHEMBL2333926",
          "CHEMBL2333927",
          "CHEMBL2333928",
          "CHEMBL2333929",
          "CHEMBL2333930",
          "CHEMBL2333931",
          "CHEMBL2333932",
          "CHEMBL2333933",
          "CHEMBL2333934",
          "CHEMBL2333935",
          "CHEMBL2333936",
          "CHEMBL2333937",
          "CHEMBL2334725",
          "CHEMBL2334726",
          "CHEMBL2334727",
          "CHEMBL2334728",
          "CHEMBL2334729",
          "CHEMBL2334730",
          "CHEMBL2334731",
          "CHEMBL2334732",
          "CHEMBL2334733",
          "CHEMBL2334734",
          "CHEMBL2334735",
          "CHEMBL2334736",
          "CHEMBL2334737",
          "CHEMBL2334738",
          "CHEMBL2334739",
          "CHEMBL2334740",
          "CHEMBL2334741",
          "CHEMBL2334742",
          "CHEMBL2334743",
          "CHEMBL2334744",
          "CHEMBL2334745",
          "CHEMBL2334746",
          "CHEMBL2337261",
          "CHEMBL2337263",
          "CHEMBL2337265",
          "CHEMBL2337267",
          "CHEMBL2337268",
          "CHEMBL2337269",
          "CHEMBL2337271",
          "CHEMBL2337272",
          "CHEMBL2337276",
          "CHEMBL2337278",
          "CHEMBL2337280",
          "CHEMBL243254",
          "CHEMBL246681",
          "CHEMBL251940",
          "CHEMBL253386",
          "CHEMBL255304",
          "CHEMBL255502",
          "CHEMBL256919",
          "CHEMBL258744",
          "CHEMBL258893",
          "CHEMBL258926",
          "CHEMBL258928",
          "CHEMBL295124",
          "CHEMBL327134",
          "CHEMBL32823",
          "CHEMBL350032",
          "CHEMBL367067",
          "CHEMBL389283",
          "CHEMBL395926",
          "CHEMBL396226",
          "CHEMBL399528",
          "CHEMBL403083",
          "CHEMBL405686",
          "CHEMBL407765",
          "CHEMBL442866",
          "CHEMBL448060",
          "CHEMBL448673",
          "CHEMBL450898",
          "CHEMBL452742",
          "CHEMBL454594",
          "CHEMBL455600",
          "CHEMBL460447",
          "CHEMBL463194",
          "CHEMBL463196",
          "CHEMBL464724",
          "CHEMBL469423",
          "CHEMBL469914",
          "CHEMBL470867",
          "CHEMBL470953",
          "CHEMBL470954",
          "CHEMBL470966",
          "CHEMBL477140",
          "CHEMBL477141",
          "CHEMBL478193",
          "CHEMBL478194",
          "CHEMBL499836",
          "CHEMBL500603",
          "CHEMBL500712",
          "CHEMBL502",
          "CHEMBL503053",
          "CHEMBL511533",
          "CHEMBL512904",
          "CHEMBL512948",
          "CHEMBL513587",
          "CHEMBL514534",
          "CHEMBL515199",
          "CHEMBL517307",
          "CHEMBL539374",
          "CHEMBL541019",
          "CHEMBL54126",
          "CHEMBL541672",
          "CHEMBL549666",
          "CHEMBL549935",
          "CHEMBL549936",
          "CHEMBL550075",
          "CHEMBL550076",
          "CHEMBL551226",
          "CHEMBL551430",
          "CHEMBL556249",
          "CHEMBL559266",
          "CHEMBL559502",
          "CHEMBL559822",
          "CHEMBL563713",
          "CHEMBL570",
          "CHEMBL589352",
          "CHEMBL589384",
          "CHEMBL589405",
          "CHEMBL589409",
          "CHEMBL589419",
          "CHEMBL589495",
          "CHEMBL589496",
          "CHEMBL589978",
          "CHEMBL590055",
          "CHEMBL590059",
          "CHEMBL590603",
          "CHEMBL591394",
          "CHEMBL591724",
          "CHEMBL591975",
          "CHEMBL592015",
          "CHEMBL592062",
          "CHEMBL592644",
          "CHEMBL596896",
          "CHEMBL597192",
          "CHEMBL597801",
          "CHEMBL597993",
          "CHEMBL598110",
          "CHEMBL598313",
          "CHEMBL598525",
          "CHEMBL598528",
          "CHEMBL598649",
          "CHEMBL598650",
          "CHEMBL598936",
          "CHEMBL599136",
          "CHEMBL599243",
          "CHEMBL599529",
          "CHEMBL599650",
          "CHEMBL599651",
          "CHEMBL599652",
          "CHEMBL600182",
          "CHEMBL600586",
          "CHEMBL600587",
          "CHEMBL602662",
          "CHEMBL602663",
          "CHEMBL602861",
          "CHEMBL605344",
          "CHEMBL605631",
          "CHEMBL606203",
          "CHEMBL609132",
          "CHEMBL610507",
          "CHEMBL610796",
          "CHEMBL636",
          "CHEMBL659",
          "CHEMBL742",
          "CHEMBL7568",
          "CHEMBL807",
          "CHEMBL85139",
          "CHEMBL94",
          "CHEMBL95"
        ],
        "number_of_missing_values": "0"
      },
      {
        "data_type": "numeric",
        "index": "1",
        "is_ignore": "false",
        "is_row_identifier": "false",
        "is_target": "false",
        "name": "AMW",
        "number_of_missing_values": "0"
      },
      {
        "data_type": "numeric",
        "index": "2",
        "is_ignore": "false",
        "is_row_identifier": "false",
        "is_target": "false",
        "name": "C.",
        "number_of_missing_values": "0"
      },
      {
        "data_type": "numeric",
        "index": "3",
        "is_ignore": "false",
        "is_row_identifier": "false",
        "is_target": "false",
        "name": "H.",
        "number_of_missing_values": "0"
      },
      {
        "data_type": "numeric",
        "index": "4",
        "is_ignore": "false",
        "is_row_identifier": "false",
        "is_target": "false",
        "name": "Me",
        "number_of_missing_values": "0"
      },
      {
        "data_type": "numeric",
        "index": "5",
        "is_ignore": "false",
        "is_row_identifier": "false",
        "is_target": "false",
        "name": "Mi",
        "number_of_missing_values": "0"
      },
      {
        "data_type": "numeric",
        "index": "6",
        "is_ignore": "false",
        "is_row_identifier": "false",
        "is_target": "false",
        "name": "Mp",
        "number_of_missing_values": "0"
      },
      {
        "data_type": "numeric",
        "index": "7",
        "is_ignore": "false",
        "is_row_identifier": "false",
        "is_target": "false",
        "name": "Mv",
        "number_of_missing_values": "0"
      },
      {
        "data_type": "numeric",
        "index": "8",
        "is_ignore": "false",
        "is_row_identifier": "false",
        "is_target": "false",
        "name": "MW",
        "number_of_missing_values": "0"
      },
      {
        "data_type": "numeric",
        "index": "9",
        "is_ignore": "false",
        "is_row_identifier": "false",
        "is_target": "false",
        "name": "N.",
        "number_of_missing_values": "0"
      },
      {
        "data_type": "numeric",
        "index": "10",
        "is_ignore": "false",
        "is_row_identifier": "false",
        "is_target": "false",
        "name": "nAB",
        "number_of_missing_values": "0"
      },
      {
        "data_type": "numeric",
        "index": "11",
        "is_ignore": "false",
        "is_row_identifier": "false",
        "is_target": "false",
        "name": "nAT",
        "number_of_missing_values": "0"
      },
      {
        "data_type": "numeric",
        "index": "12",
        "is_ignore": "false",
        "is_row_identifier": "false",
        "is_target": "false",
        "name": "nB",
        "number_of_missing_values": "0"
      },
      {
        "data_type": "numeric",
        "index": "13",
        "is_ignore": "false",
        "is_row_identifier": "false",
        "is_target": "false",
        "name": "nBM",
        "number_of_missing_values": "0"
      },
      {
        "data_type": "numeric",
        "index": "14",
        "is_ignore": "false",
        "is_row_identifier": "false",
        "is_target": "false",
        "name": "nBO",
        "number_of_missing_values": "0"
      },
      {
        "data_type": "numeric",
        "index": "15",
        "is_ignore": "false",
        "is_row_identifier": "false",
        "is_target": "false",
        "name": "nBR",
        "number_of_missing_values": "0"
      },
      {
        "data_type": "numeric",
        "index": "16",
        "is_ignore": "false",
        "is_row_identifier": "false",
        "is_target": "false",
        "name": "nBT",
        "number_of_missing_values": "0"
      },
      {
        "data_type": "numeric",
        "index": "17",
        "is_ignore": "false",
        "is_row_identifier": "false",
        "is_target": "false",
        "name": "nC",
        "number_of_missing_values": "0"
      },
      {
        "data_type": "numeric",
        "index": "18",
        "is_ignore": "false",
        "is_row_identifier": "false",
        "is_target": "false",
        "name": "nCL",
        "number_of_missing_values": "0"
      },
      {
        "data_type": "numeric",
        "index": "19",
        "is_ignore": "false",
        "is_row_identifier": "false",
        "is_target": "false",
        "name": "nCsp",
        "number_of_missing_values": "0"
      },
      {
        "data_type": "numeric",
        "index": "20",
        "is_ignore": "false",
        "is_row_identifier": "false",
        "is_target": "false",
        "name": "nCsp2",
        "number_of_missing_values": "0"
      },
      {
        "data_type": "numeric",
        "index": "21",
        "is_ignore": "false",
        "is_row_identifier": "false",
        "is_target": "false",
        "name": "nCsp3",
        "number_of_missing_values": "0"
      },
      {
        "data_type": "numeric",
        "index": "22",
        "is_ignore": "false",
        "is_row_identifier": "false",
        "is_target": "false",
        "name": "nDB",
        "number_of_missing_values": "0"
      },
      {
        "data_type": "numeric",
        "index": "23",
        "is_ignore": "false",
        "is_row_identifier": "false",
        "is_target": "false",
        "name": "nF",
        "number_of_missing_values": "0"
      },
      {
        "data_type": "numeric",
        "index": "24",
        "is_ignore": "false",
        "is_row_identifier": "false",
        "is_target": "false",
        "name": "nH",
        "number_of_missing_values": "0"
      },
      {
        "data_type": "numeric",
        "index": "25",
        "is_ignore": "false",
        "is_row_identifier": "false",
        "is_target": "false",
        "name": "nHet",
        "number_of_missing_values": "0"
      },
      {
        "data_type": "numeric",
        "index": "26",
        "is_ignore": "false",
        "is_row_identifier": "false",
        "is_target": "false",
        "name": "nHM",
        "number_of_missing_values": "0"
      },
      {
        "data_type": "numeric",
        "index": "27",
        "is_ignore": "false",
        "is_row_identifier": "false",
        "is_target": "false",
        "name": "nI",
        "number_of_missing_values": "0"
      },
      {
        "data_type": "numeric",
        "index": "28",
        "is_ignore": "false",
        "is_row_identifier": "false",
        "is_target": "false",
        "name": "nN",
        "number_of_missing_values": "0"
      },
      {
        "data_type": "numeric",
        "index": "29",
        "is_ignore": "false",
        "is_row_identifier": "false",
        "is_target": "false",
        "name": "nO",
        "number_of_missing_values": "0"
      },
      {
        "data_type": "numeric",
        "index": "30",
        "is_ignore": "false",
        "is_row_identifier": "false",
        "is_target": "false",
        "name": "nP",
        "number_of_missing_values": "0"
      },
      {
        "data_type": "numeric",
        "index": "31",
        "is_ignore": "false",
        "is_row_identifier": "false",
        "is_target": "false",
        "name": "nS",
        "number_of_missing_values": "0"
      },
      {
        "data_type": "numeric",
        "index": "32",
        "is_ignore": "false",
        "is_row_identifier": "false",
        "is_target": "false",
        "name": "nSK",
        "number_of_missing_values": "0"
      },
      {
        "data_type": "numeric",
        "index": "33",
        "is_ignore": "false",
        "is_row_identifier": "false",
        "is_target": "false",
        "name": "nTB",
        "number_of_missing_values": "0"
      },
      {
        "data_type": "numeric",
        "index": "34",
        "is_ignore": "false",
        "is_row_identifier": "false",
        "is_target": "false",
        "name": "nX",
        "number_of_missing_values": "0"
      },
      {
        "data_type": "numeric",
        "index": "35",
        "is_ignore": "false",
        "is_row_identifier": "false",
        "is_target": "false",
        "name": "O.",
        "number_of_missing_values": "0"
      },
      {
        "data_type": "numeric",
        "index": "36",
        "is_ignore": "false",
        "is_row_identifier": "false",
        "is_target": "false",
        "name": "RBF",
        "number_of_missing_values": "0"
      },
      {
        "data_type": "numeric",
        "index": "37",
        "is_ignore": "false",
        "is_row_identifier": "false",
        "is_target": "false",
        "name": "RBN",
        "number_of_missing_values": "0"
      },
      {
        "data_type": "numeric",
        "index": "38",
        "is_ignore": "false",
        "is_row_identifier": "false",
        "is_target": "false",
        "name": "SCBO",
        "number_of_missing_values": "0"
      },
      {
        "data_type": "numeric",
        "index": "39",
        "is_ignore": "false",
        "is_row_identifier": "false",
        "is_target": "false",
        "name": "Se",
        "number_of_missing_values": "0"
      },
      {
        "data_type": "numeric",
        "index": "40",
        "is_ignore": "false",
        "is_row_identifier": "false",
        "is_target": "false",
        "name": "Si",
        "number_of_missing_values": "0"
      },
      {
        "data_type": "numeric",
        "index": "41",
        "is_ignore": "false",
        "is_row_identifier": "false",
        "is_target": "false",
        "name": "Sp",
        "number_of_missing_values": "0"
      },
      {
        "data_type": "numeric",
        "index": "42",
        "is_ignore": "false",
        "is_row_identifier": "false",
        "is_target": "false",
        "name": "Sv",
        "number_of_missing_values": "0"
      },
      {
        "data_type": "numeric",
        "index": "43",
        "is_ignore": "false",
        "is_row_identifier": "false",
        "is_target": "false",
        "name": "X.",
        "number_of_missing_values": "0"
      },
      {
        "data_type": "numeric",
        "index": "44",
        "is_ignore": "false",
        "is_row_identifier": "false",
        "is_target": "true",
        "name": "pXC50",
        "number_of_missing_values": "0"
      }
    ]
  }
}