"molecule_id","FCFP4_1024b131","FCFP4_1024b410","FCFP4_1024b208","FCFP4_1024b144","FCFP4_1024b986","FCFP4_1024b1022","FCFP4_1024b218","FCFP4_1024b844","FCFP4_1024b63","FCFP4_1024b859","FCFP4_1024b861","FCFP4_1024b651","FCFP4_1024b936","FCFP4_1024b780","FCFP4_1024b113","FCFP4_1024b728","FCFP4_1024b891","FCFP4_1024b401","FCFP4_1024b657","FCFP4_1024b1","FCFP4_1024b10","FCFP4_1024b100","FCFP4_1024b1000","FCFP4_1024b1001","FCFP4_1024b1002","FCFP4_1024b1003","FCFP4_1024b1004","FCFP4_1024b1005","FCFP4_1024b1006","FCFP4_1024b1007","FCFP4_1024b1008","FCFP4_1024b1009","FCFP4_1024b101","FCFP4_1024b1010","FCFP4_1024b1011","FCFP4_1024b1012","FCFP4_1024b1013","FCFP4_1024b1014","FCFP4_1024b1015","FCFP4_1024b1016","FCFP4_1024b1017","FCFP4_1024b1018","FCFP4_1024b1019","FCFP4_1024b102","FCFP4_1024b1020","FCFP4_1024b1021","FCFP4_1024b1023","FCFP4_1024b1024","FCFP4_1024b103","FCFP4_1024b104","FCFP4_1024b105","pXC50"
{14 1,15 1,16 1,18 1,19 1,20 1,52 4.658}
{0 CHEMBL115426,4 1,5 1,9 1,10 1,11 1,12 1,17 1,20 1,51 1,52 5.125}
{0 CHEMBL115630,4 1,5 1,9 1,17 1,20 1,52 5.398}
{0 CHEMBL115701,1 1,2 1,3 1,10 1,17 1,20 1,52 5.921}
{0 CHEMBL115757,1 1,2 1,3 1,10 1,17 1,20 1,52 5.398}
{0 CHEMBL11585,14 1,15 1,16 1,18 1,19 1,20 1,52 5.824}
{0 CHEMBL115957,4 1,5 1,9 1,11 1,12 1,17 1,20 1,52 4.721}
{0 CHEMBL116036,1 1,2 1,3 1,10 1,17 1,20 1,52 5.301}
{0 CHEMBL116037,4 1,5 1,9 1,11 1,12 1,17 1,20 1,52 4.602}
{0 CHEMBL116264,4 1,5 1,9 1,11 1,12 1,17 1,20 1,52 6.398}
{0 CHEMBL116358,4 1,5 1,9 1,11 1,12 1,16 1,17 1,20 1,52 4.699}
{0 CHEMBL11641,10 1,14 1,15 1,16 1,20 1,52 8.398}
{0 CHEMBL116429,1 1,2 1,3 1,10 1,17 1,20 1,52 4.854}
{0 CHEMBL116458,1 1,2 1,17 1,20 1,52 6.301}
{0 CHEMBL116477,1 1,2 1,3 1,10 1,17 1,20 1,52 5.523}
{0 CHEMBL11651,10 1,14 1,15 1,16 1,20 1,52 5.699}
{0 CHEMBL11659,14 1,15 1,16 1,18 1,19 1,20 1,52 5.796}
{0 CHEMBL116623,4 1,5 1,9 1,17 1,20 1,52 4}
{0 CHEMBL116746,2 1,17 1,20 1,52 4.495}
{0 CHEMBL116863,1 1,2 1,3 1,10 1,17 1,20 1,52 5.097}
{0 CHEMBL116894,1 1,2 1,3 1,10 1,16 1,17 1,20 1,52 5.481}
{0 CHEMBL117023,17 1,20 1,52 5.347}
{0 CHEMBL117232,4 1,5 1,9 1,11 1,12 1,17 1,20 1,52 4.301}
{0 CHEMBL117255,4 1,5 1,9 1,11 1,12 1,17 1,20 1,52 4.26}
{0 CHEMBL117336,1 1,2 1,3 1,10 1,17 1,20 1,52 5.886}
{0 CHEMBL117450,4 1,5 1,9 1,12 1,17 1,20 1,52 4.824}
{0 CHEMBL117508,4 1,5 1,9 1,17 1,20 1,52 4.77}
{0 CHEMBL117706,4 1,5 1,9 1,11 1,12 1,17 1,20 1,52 4.161}
{0 CHEMBL117801,4 1,5 1,9 1,11 1,12 1,17 1,20 1,51 1,52 4.638}
{0 CHEMBL117839,17 1,20 1,52 4.658}
{0 CHEMBL117891,4 1,5 1,9 1,11 1,12 1,16 1,17 1,20 1,52 4.602}
{0 CHEMBL117905,4 1,5 1,9 1,11 1,12 1,17 1,20 1,52 4.523}
{0 CHEMBL118025,1 1,2 1,17 1,20 1,52 5.886}
{0 CHEMBL11843,10 1,14 1,15 1,16 1,20 1,52 4.553}
{0 CHEMBL11844,10 1,14 1,15 1,16 1,20 1,52 6.886}
{0 CHEMBL118907,4 1,5 1,9 1,10 1,11 1,12 1,17 1,20 1,51 1,52 4.638}
{0 CHEMBL118908,17 1,20 1,52 5.824}
{0 CHEMBL119011,4 1,5 1,9 1,11 1,12 1,17 1,20 1,52 4.377}
{0 CHEMBL11929,14 1,15 1,16 1,18 1,19 1,20 1,52 5.959}
{0 CHEMBL119622,1 1,2 1,3 1,10 1,17 1,20 1,52 6.699}
{0 CHEMBL11966,10 1,14 1,15 1,16 1,20 1,52 4.745}
{0 CHEMBL12145,10 1,14 1,15 1,16 1,20 1,52 7}
{0 CHEMBL129157,15 1,16 1,18 1,19 1,20 1,52 6.509}
{0 CHEMBL129831,1 1,2 1,3 1,6 1,7 1,8 1,10 1,17 1,20 1,52 9.824}
{0 CHEMBL130122,1 1,2 1,3 1,6 1,7 1,8 1,10 1,13 1,17 1,20 1,52 10.143}
{0 CHEMBL130146,1 1,2 1,3 1,6 1,7 1,8 1,10 1,13 1,17 1,20 1,52 9.495}
{0 CHEMBL130345,1 1,2 1,3 1,10 1,11 1,17 1,20 1,52 9.959}
{0 CHEMBL130359,1 1,2 1,3 1,6 1,7 1,8 1,10 1,13 1,17 1,20 1,39 1,52 9.658}
{0 CHEMBL130580,1 1,2 1,3 1,10 1,17 1,20 1,52 9.658}
{0 CHEMBL130599,1 1,2 1,3 1,6 1,7 1,8 1,10 1,13 1,17 1,20 1,52 9.921}
{0 CHEMBL130629,1 1,2 1,3 1,6 1,7 1,8 1,10 1,13 1,17 1,20 1,43 1,52 9.959}
{0 CHEMBL130722,1 1,2 1,3 1,10 1,17 1,20 1,52 9.056}
{0 CHEMBL131002,1 1,2 1,3 1,6 1,7 1,8 1,10 1,13 1,17 1,20 1,52 9.678}
{0 CHEMBL131257,1 1,2 1,3 1,10 1,17 1,20 1,52 8.921}
{0 CHEMBL131540,1 1,2 1,3 1,10 1,17 1,20 1,52 10.509}
{0 CHEMBL131639,1 1,2 1,3 1,6 1,7 1,8 1,10 1,13 1,17 1,20 1,52 10}
{0 CHEMBL131707,1 1,2 1,3 1,10 1,17 1,20 1,52 10.018}
{0 CHEMBL131779,1 1,2 1,3 1,10 1,17 1,20 1,52 9.26}
{0 CHEMBL131866,1 1,2 1,17 1,20 1,52 9.481}
{0 CHEMBL132526,1 1,2 1,3 1,6 1,7 1,8 1,10 1,13 1,17 1,20 1,52 9.77}
{0 CHEMBL132566,1 1,2 1,3 1,10 1,17 1,20 1,32 1,51 1,52 9.638}
{0 CHEMBL132611,1 1,2 1,3 1,10 1,17 1,20 1,21 1,52 9.854}
{0 CHEMBL132732,1 1,2 1,3 1,6 1,7 1,8 1,10 1,13 1,17 1,20 1,52 9.509}
{0 CHEMBL132987,1 1,2 1,3 1,6 1,7 1,8 1,10 1,17 1,20 1,52 10.201}
{0 CHEMBL133243,1 1,2 1,3 1,6 1,7 1,8 1,10 1,13 1,16 1,17 1,20 1,52 8.469}
{0 CHEMBL133521,1 1,2 1,3 1,6 1,7 1,8 1,10 1,13 1,17 1,20 1,52 9.959}
{0 CHEMBL133707,1 1,2 1,3 1,6 1,7 1,8 1,10 1,13 1,17 1,20 1,52 9.194}
{0 CHEMBL133749,1 1,2 1,17 1,20 1,52 9.244}
{0 CHEMBL133806,1 1,2 1,3 1,6 1,7 1,8 1,10 1,13 1,17 1,20 1,52 7.699}
{0 CHEMBL133936,1 1,2 1,3 1,6 1,7 1,8 1,10 1,13 1,17 1,20 1,52 8.678}
{0 CHEMBL133970,1 1,2 1,17 1,20 1,52 9.347}
{0 CHEMBL134092,1 1,2 1,3 1,6 1,7 1,8 1,10 1,13 1,17 1,20 1,52 9.523}
{0 CHEMBL273817,1 1,2 1,3 1,10 1,17 1,20 1,32 1,51 1,52 9.18}
{0 CHEMBL274606,14 1,15 1,16 1,18 1,19 1,20 1,52 6.824}
{0 CHEMBL275570,14 1,15 1,16 1,18 1,19 1,20 1,52 4}
{0 CHEMBL311735,5 1,20 1,45 1,52 6.921}
{0 CHEMBL324834,4 1,5 1,9 1,17 1,20 1,52 4.347}
{0 CHEMBL325147,1 1,2 1,3 1,10 1,17 1,20 1,52 5.62}
{0 CHEMBL325223,1 1,2 1,3 1,10 1,17 1,20 1,52 5.585}
{0 CHEMBL325401,2 1,17 1,20 1,52 5.469}
{0 CHEMBL326290,1 1,2 1,3 1,10 1,17 1,20 1,52 5.523}
{0 CHEMBL331383,4 1,5 1,9 1,11 1,12 1,17 1,20 1,52 4.854}
{0 CHEMBL331850,1 1,2 1,3 1,10 1,17 1,20 1,52 5.032}
{0 CHEMBL332924,4 1,5 1,9 1,11 1,12 1,17 1,20 1,51 1,52 4.62}
{0 CHEMBL333388,4 1,5 1,9 1,12 1,17 1,20 1,52 5.398}
{0 CHEMBL334744,1 1,2 1,3 1,10 1,17 1,20 1,52 9.721}
{0 CHEMBL335706,1 1,2 1,3 1,10 1,17 1,20 1,51 1,52 9.658}
{0 CHEMBL337462,1 1,2 1,3 1,10 1,17 1,20 1,52 9.456}
{0 CHEMBL337608,1 1,2 1,17 1,20 1,52 8.77}
{0 CHEMBL337635,1 1,2 1,3 1,10 1,17 1,20 1,21 1,52 10.027}
{0 CHEMBL337684,1 1,2 1,3 1,6 1,7 1,8 1,10 1,13 1,17 1,20 1,52 9.194}
{0 CHEMBL337830,1 1,2 1,3 1,6 1,7 1,8 1,10 1,13 1,17 1,20 1,52 9.42}
{0 CHEMBL338957,1 1,2 1,3 1,10 1,17 1,20 1,52 8.367}
{0 CHEMBL339174,1 1,2 1,3 1,6 1,7 1,8 1,10 1,17 1,20 1,52 9.678}
{0 CHEMBL339869,1 1,2 1,3 1,6 1,7 1,8 1,10 1,13 1,17 1,20 1,52 9.62}
{0 CHEMBL341219,1 1,2 1,3 1,6 1,7 1,8 1,10 1,13 1,17 1,20 1,52 9.921}
{0 CHEMBL413308,1 1,2 1,3 1,6 1,7 1,8 1,10 1,13 1,17 1,20 1,52 9.921}
{0 CHEMBL417071,14 1,15 1,16 1,18 1,19 1,20 1,52 7.409}
{0 CHEMBL419590,1 1,2 1,17 1,20 1,52 5.337}
{0 CHEMBL420872,1 1,2 1,3 1,10 1,17 1,20 1,52 5.222}
{0 CHEMBL421910,1 1,2 1,3 1,6 1,7 1,8 1,10 1,13 1,17 1,20 1,52 10.201}
{0 CHEMBL432433,4 1,5 1,17 1,20 1,52 4.509}
{0 CHEMBL432443,1 1,2 1,3 1,10 1,17 1,20 1,52 5.523}
{0 CHEMBL433112,5 1,16 1,20 1,27 1,52 3.889}
{0 CHEMBL435203,1 1,2 1,3 1,6 1,7 1,8 1,10 1,13 1,17 1,20 1,43 1,52 9.854}
{0 CHEMBL441280,1 1,2 1,3 1,10 1,17 1,20 1,52 5.398}
{0 CHEMBL444594,1 1,2 1,3 1,10 1,17 1,20 1,52 4.886}
{0 CHEMBL48605,14 1,15 1,16 1,17 1,18 1,19 1,20 1,52 5.903}
{0 CHEMBL48837,14 1,17 1,20 1,52 6.67}
{0 CHEMBL48945,14 1,15 1,16 1,17 1,18 1,19 1,20 1,52 6.194}
{0 CHEMBL51128,5 1,10 1,14 1,16 1,17 1,20 1,52 7.398}
