{
  "data_features": {
    "feature": [
      {
        "data_type": "nominal",
        "index": "0",
        "is_ignore": "false",
        "is_row_identifier": "true",
        "is_target": "false",
        "name": "molecule_id",
        "nominal_value": [
          "CHEMBL203649",
          "CHEMBL203801",
          "CHEMBL203802",
          "CHEMBL203823",
          "CHEMBL203856",
          "CHEMBL204035",
          "CHEMBL204344",
          "CHEMBL204452",
          "CHEMBL204491",
          "CHEMBL204850",
          "CHEMBL204973",
          "CHEMBL205056",
          "CHEMBL221471",
          "CHEMBL221833",
          "CHEMBL221991",
          "CHEMBL222270",
          "CHEMBL222322",
          "CHEMBL222325",
          "CHEMBL222706",
          "CHEMBL222707",
          "CHEMBL222708",
          "CHEMBL222709",
          "CHEMBL222870",
          "CHEMBL222871",
          "CHEMBL224801",
          "CHEMBL224803",
          "CHEMBL224858",
          "CHEMBL224915",
          "CHEMBL224916",
          "CHEMBL373909",
          "CHEMBL374367",
          "CHEMBL374508",
          "CHEMBL374510",
          "CHEMBL376232",
          "CHEMBL379228",
          "CHEMBL380140",
          "CHEMBL381093",
          "CHEMBL382027",
          "CHEMBL383231",
          "CHEMBL426564",
          "CHEMBL436500",
          "CHEMBL438659",
          "CHEMBL440764",
          "CHEMBL486232",
          "CHEMBL487275",
          "CHEMBL488829"
        ],
        "number_of_missing_values": "0"
      },
      {
        "data_type": "numeric",
        "index": "1",
        "is_ignore": "false",
        "is_row_identifier": "false",
        "is_target": "false",
        "name": "AMW",
        "number_of_missing_values": "0"
      },
      {
        "data_type": "numeric",
        "index": "2",
        "is_ignore": "false",
        "is_row_identifier": "false",
        "is_target": "false",
        "name": "C.",
        "number_of_missing_values": "0"
      },
      {
        "data_type": "numeric",
        "index": "3",
        "is_ignore": "false",
        "is_row_identifier": "false",
        "is_target": "true",
        "name": "pXC50",
        "number_of_missing_values": "0"
      }
    ]
  }
}