{
  "data_qualities": {
    "quality": [
      {
        "name": "AutoCorrelation",
        "value": "0.46374446374446376"
      },
      {
        "name": "CfsSubsetEval_DecisionStumpAUC",
        "value": "0.9525893765375607"
      },
      {
        "name": "CfsSubsetEval_DecisionStumpErrRate",
        "value": "0.106959"
      },
      {
        "name": "CfsSubsetEval_DecisionStumpKappa",
        "value": "0.7987920883644265"
      },
      {
        "name": "CfsSubsetEval_NaiveBayesAUC",
        "value": "0.9525893765375607"
      },
      {
        "name": "CfsSubsetEval_NaiveBayesErrRate",
        "value": "0.106959"
      },
      {
        "name": "CfsSubsetEval_NaiveBayesKappa",
        "value": "0.7987920883644265"
      },
      {
        "name": "CfsSubsetEval_kNN1NAUC",
        "value": "0.9525893765375607"
      },
      {
        "name": "CfsSubsetEval_kNN1NErrRate",
        "value": "0.106959"
      },
      {
        "name": "CfsSubsetEval_kNN1NKappa",
        "value": "0.7987920883644265"
      },
      {
        "name": "ClassEntropy",
        "value": "1.2562056674968567"
      },
      {
        "name": "DecisionStumpAUC",
        "value": "0.7532346598100107"
      },
      {
        "name": "DecisionStumpErrRate",
        "value": "0.273471"
      },
      {
        "name": "DecisionStumpKappa",
        "value": "0.4788451693464286"
      },
      {
        "name": "Dimensionality",
        "value": "1.9E-5"
      },
      {
        "name": "EquivalentNumberOfAtts",
        "value": "15.260742108126458"
      },
      {
        "name": "J48.00001.AUC",
        "value": "0.9618119207180185"
      },
      {
        "name": "J48.00001.ErrRate",
        "value": "0.08244"
      },
      {
        "name": "J48.00001.Kappa",
        "value": "0.8451590629533324"
      },
      {
        "name": "J48.0001.AUC",
        "value": "0.9618119207180185"
      },
      {
        "name": "J48.0001.ErrRate",
        "value": "0.08244"
      },
      {
        "name": "J48.0001.Kappa",
        "value": "0.8451590629533324"
      },
      {
        "name": "J48.001.AUC",
        "value": "0.9618119207180185"
      },
      {
        "name": "J48.001.ErrRate",
        "value": "0.08244"
      },
      {
        "name": "J48.001.Kappa",
        "value": "0.8451590629533324"
      },
      {
        "name": "MajorityClassPercentage",
        "value": "54.34949999999999"
      },
      {
        "name": "MajorityClassSize",
        "value": "543495.0"
      },
      {
        "name": "MaxAttributeEntropy",
        "value": "2.723239634537262"
      },
      {
        "name": "MaxKurtosisOfNumericAtts",
        "value": "18.75326070429752"
      },
      {
        "name": "MaxMeansOfNumericAtts",
        "value": "2.6134477578170023"
      },
      {
        "name": "MaxMutualInformation",
        "value": "0.26343480307106"
      },
      {
        "name": "MaxNominalAttDistinctValues",
        "value": "8.0"
      },
      {
        "name": "MaxSkewnessOfNumericAtts",
        "value": "4.411711376693278"
      },
      {
        "name": "MaxStdDevOfNumericAtts",
        "value": "1.8756448367786893"
      },
      {
        "name": "MeanAttributeEntropy",
        "value": "1.1603538163656784"
      },
      {
        "name": "MeanKurtosisOfNumericAtts",
        "value": "6.157034389713749"
      },
      {
        "name": "MeanMeansOfNumericAtts",
        "value": "2.0712172526056696"
      },
      {
        "name": "MeanMutualInformation",
        "value": "0.08231615858496934"
      },
      {
        "name": "MeanNoiseToSignalRatio",
        "value": "13.096306682823695"
      },
      {
        "name": "MeanNominalAttDistinctValues",
        "value": "3.0"
      },
      {
        "name": "MeanSkewnessOfNumericAtts",
        "value": "1.9564480044895443"
      },
      {
        "name": "MeanStdDevOfNumericAtts",
        "value": "1.0314658867612234"
      },
      {
        "name": "MinAttributeEntropy",
        "value": "0.3452749744006563"
      },
      {
        "name": "MinKurtosisOfNumericAtts",
        "value": "-0.6385294023659185"
      },
      {
        "name": "MinMeansOfNumericAtts",
        "value": "1.0865320000000074"
      },
      {
        "name": "MinMutualInformation",
        "value": "0.00885303321242"
      },
      {
        "name": "MinNominalAttDistinctValues",
        "value": "2.0"
      },
      {
        "name": "MinSkewnessOfNumericAtts",
        "value": "0.2818333847334242"
      },
      {
        "name": "MinStdDevOfNumericAtts",
        "value": "0.3679732984584612"
      },
      {
        "name": "MinorityClassPercentage",
        "value": "1.6507999999999998"
      },
      {
        "name": "MinorityClassSize",
        "value": "16508.0"
      },
      {
        "name": "NaiveBayesAUC",
        "value": "0.9468313845335228"
      },
      {
        "name": "NaiveBayesErrRate",
        "value": "0.130285"
      },
      {
        "name": "NaiveBayesKappa",
        "value": "0.7587133376199122"
      },
      {
        "name": "NumberOfBinaryFeatures",
        "value": "9.0"
      },
      {
        "name": "NumberOfClasses",
        "value": "4.0"
      },
      {
        "name": "NumberOfFeatures",
        "value": "19.0"
      },
      {
        "name": "NumberOfInstances",
        "value": "1000000.0"
      },
      {
        "name": "NumberOfInstancesWithMissingValues",
        "value": "0.0"
      },
      {
        "name": "NumberOfMissingValues",
        "value": "0.0"
      },
      {
        "name": "NumberOfNumericFeatures",
        "value": "3.0"
      },
      {
        "name": "NumberOfSymbolicFeatures",
        "value": "16.0"
      },
      {
        "name": "PercentageOfBinaryFeatures",
        "value": "47.368421052631575"
      },
      {
        "name": "PercentageOfInstancesWithMissingValues",
        "value": "0.0"
      },
      {
        "name": "PercentageOfMissingValues",
        "value": "0.0"
      },
      {
        "name": "PercentageOfNumericFeatures",
        "value": "15.789473684210526"
      },
      {
        "name": "PercentageOfSymbolicFeatures",
        "value": "84.21052631578947"
      },
      {
        "name": "Quartile1AttributeEntropy",
        "value": "0.7877261423146888"
      },
      {
        "name": "Quartile1KurtosisOfNumericAtts",
        "value": "-0.6385294023659185"
      },
      {
        "name": "Quartile1MeansOfNumericAtts",
        "value": "1.0865320000000074"
      },
      {
        "name": "Quartile1MutualInformation",
        "value": "0.03861619480877"
      },
      {
        "name": "Quartile1SkewnessOfNumericAtts",
        "value": "0.2818333847334242"
      },
      {
        "name": "Quartile1StdDevOfNumericAtts",
        "value": "0.3679732984584612"
      },
      {
        "name": "Quartile2AttributeEntropy",
        "value": "0.9913699371659555"
      },
      {
        "name": "Quartile2KurtosisOfNumericAtts",
        "value": "0.35637186720964387"
      },
      {
        "name": "Quartile2MeansOfNumericAtts",
        "value": "2.5136719999999984"
      },
      {
        "name": "Quartile2MutualInformation",
        "value": "0.06535685954581"
      },
      {
        "name": "Quartile2SkewnessOfNumericAtts",
        "value": "1.1757992520419303"
      },
      {
        "name": "Quartile2StdDevOfNumericAtts",
        "value": "0.8507795250465198"
      },
      {
        "name": "Quartile3AttributeEntropy",
        "value": "1.6373342149481895"
      },
      {
        "name": "Quartile3KurtosisOfNumericAtts",
        "value": "18.75326070429752"
      },
      {
        "name": "Quartile3MeansOfNumericAtts",
        "value": "2.6134477578170023"
      },
      {
        "name": "Quartile3MutualInformation",
        "value": "0.11813432242576"
      },
      {
        "name": "Quartile3SkewnessOfNumericAtts",
        "value": "4.411711376693278"
      },
      {
        "name": "Quartile3StdDevOfNumericAtts",
        "value": "1.8756448367786893"
      },
      {
        "name": "REPTreeDepth1AUC",
        "value": "0.9654312871259095"
      },
      {
        "name": "REPTreeDepth1ErrRate",
        "value": "0.089084"
      },
      {
        "name": "REPTreeDepth1Kappa",
        "value": "0.8325292469524697"
      },
      {
        "name": "REPTreeDepth2AUC",
        "value": "0.9654312871259095"
      },
      {
        "name": "REPTreeDepth2ErrRate",
        "value": "0.089084"
      },
      {
        "name": "REPTreeDepth2Kappa",
        "value": "0.8325292469524697"
      },
      {
        "name": "REPTreeDepth3AUC",
        "value": "0.9654312871259095"
      },
      {
        "name": "REPTreeDepth3ErrRate",
        "value": "0.089084"
      },
      {
        "name": "REPTreeDepth3Kappa",
        "value": "0.8325292469524697"
      },
      {
        "name": "RandomTreeDepth1AUC",
        "value": "0.9148261423353723"
      },
      {
        "name": "RandomTreeDepth1ErrRate",
        "value": "0.10737"
      },
      {
        "name": "RandomTreeDepth1Kappa",
        "value": "0.7986168101743286"
      },
      {
        "name": "RandomTreeDepth2AUC",
        "value": "0.9148261423353723"
      },
      {
        "name": "RandomTreeDepth2ErrRate",
        "value": "0.10737"
      },
      {
        "name": "RandomTreeDepth2Kappa",
        "value": "0.7986168101743286"
      },
      {
        "name": "RandomTreeDepth3AUC",
        "value": "0.9148261423353723"
      },
      {
        "name": "RandomTreeDepth3ErrRate",
        "value": "0.10737"
      },
      {
        "name": "RandomTreeDepth3Kappa",
        "value": "0.7986168101743286"
      },
      {
        "name": "StdvNominalAttDistinctValues",
        "value": "1.591644851508443"
      },
      {
        "name": "kNN1NAUC",
        "value": "0.9389865952001077"
      },
      {
        "name": "kNN1NErrRate",
        "value": "0.100868"
      },
      {
        "name": "kNN1NKappa",
        "value": "0.8096255087337635"
      }
    ]
  }
}