"molecule_id","AMW","C.","H.","Me","Mi","Mp","Mv","MW","N.","nAB","nAT","nB","nBM","nBO","nBR","nBT","nC","nCL","nCsp","nCsp2","nCsp3","nDB","nF","nH","nHet","nHM","nI","nN","nO","nP","nS","nSK","nTB","nX","O.","RBF","RBN","SCBO","Se","Si","Sp","Sv","X.","pXC50"
{1 7.393,2 42.2,3 48,4 0.996,5 1.116,6 0.676,7 0.628,8 754.08,9 2,10 22,11 102,13 31,14 58,16 107,17 43,20 29,21 14,22 9,24 49,25 10,26 2,28 2,29 6,31 2,32 53,35 5.9,36 0.131,37 14,38 78,39 101.585,40 113.85,41 68.927,42 64.086,44 5.939}
{0 CHEMBL129,1 8.353,2 31.3,3 40.6,4 1.042,5 1.156,6 0.622,7 0.627,8 267.28,9 15.6,11 32,13 5,14 20,16 33,17 10,20 4,21 6,22 5,24 13,25 9,28 5,29 4,32 19,35 12.5,36 0.091,37 3,38 25,39 33.353,40 36.99,41 19.892,42 20.073,44 4.585}
{0 CHEMBL1686,1 9.132,2 31.3,3 37.5,4 1.08,5 1.143,6 0.597,7 0.635,8 146.11,11 16,13 3,14 9,16 15,17 5,20 3,21 2,22 3,24 6,25 5,29 5,32 10,35 31.3,36 0.267,37 4,38 12,39 17.287,40 18.293,41 9.557,42 10.154,44 4.75}
{0 CHEMBL424,1 8.633,2 43.8,3 37.5,4 1.04,5 1.117,6 0.665,7 0.67,8 138.13,10 6,11 16,13 7,14 10,16 16,17 7,20 7,22 1,24 6,25 3,29 3,32 10,35 18.8,36 0.063,37 1,38 14,39 16.633,40 17.874,41 10.648,42 10.725,44 4.071}
{0 CHEMBL472,1 8.099,2 37.7,3 45.9,4 1.014,5 1.128,6 0.667,7 0.631,8 494.06,9 4.9,10 12,11 61,13 16,14 35,16 63,17 23,18 1,20 14,21 9,22 4,24 28,25 10,26 2,28 3,29 5,31 1,32 33,34 1,35 8.2,36 0.127,37 8,38 45,39 61.829,40 68.804,41 40.693,42 38.501,43 1.6,44 4.91}
{0 CHEMBL548,1 6.185,2 35.1,3 56.1,4 0.996,5 1.135,6 0.604,7 0.561,8 352.52,11 57,13 4,14 25,16 57,17 20,20 6,21 14,22 4,24 32,25 5,29 5,32 25,35 8.8,36 0.211,37 12,38 29,39 56.774,40 64.69,41 34.455,42 32.003,44 4.415}
{0 CHEMBL571,1 7.706,2 48.5,3 42.4,4 1.005,5 1.107,6 0.688,7 0.662,8 254.3,10 12,11 33,13 14,14 20,16 34,17 16,20 14,21 2,22 2,24 14,25 3,29 3,32 19,35 9.1,36 0.118,37 4,38 28,39 33.167,40 36.535,41 22.693,42 21.832,44 5.735}
{0 CHEMBL6,1 8.727,2 46.3,3 39,4 1.02,5 1.112,6 0.702,7 0.681,8 357.81,9 2.4,10 16,11 41,13 18,14 27,16 43,17 19,18 1,20 16,21 3,22 2,24 16,25 6,26 1,28 1,29 4,32 25,34 1,35 9.8,36 0.093,37 4,38 37,39 41.804,40 45.602,41 28.773,42 27.923,43 2.4,44 6.437}
{0 CHEMBL815,1 6.009,2 33.9,3 57.6,4 0.994,5 1.137,6 0.597,7 0.551,8 354.54,11 59,13 3,14 25,16 59,17 20,20 5,21 15,22 3,24 34,25 5,29 5,32 25,35 8.5,36 0.203,37 12,38 28,39 58.658,40 67.105,41 35.216,42 32.53,44 6.383}
{0 CHEMBL853,1 7.545,2 32.1,3 46.4,4 1.025,5 1.15,6 0.614,7 0.602,8 211.25,9 10.7,11 28,13 3,14 16,16 29,17 9,20 4,21 5,22 3,24 13,25 6,28 3,29 3,32 15,35 10.7,36 0.069,37 2,38 19,39 28.705,40 32.199,41 17.188,42 16.843,44 2.523}
