{
  "data_set_description": {
    "collection_date": "November 2013",
    "creator": "Dr Jeremy Besnard, Dr Ivan Olier, Dr Noureddin Sadawi, Dr Larisa Soldatova, Dr Crina Grosan, Prof Ross King, Dr Richard Bickerton, Prof Andrew Hopkins and Dr Willem van Hoorn",
    "default_target_attribute": "pXC50",
    "description": "This dataset contains QSAR data (from ChEMBL version 17) showing activity values (unit is pseudo-pCI50) of several compounds on drug target ChEMBL_ID: CHEMBL3904 (TID: 11837), and it has 10 rows and 43 features (not including molecule IDs and class feature: molecule_id and pXC50). The features represent Basic Molecular Descriptors which were generated from SMILES strings.  Missing value imputation was applied to this dataset (By choosing the Median).",
    "description_version": "1",
    "file_id": "3254966",
    "format": "ARFF",
    "id": "24857",
    "licence": "Public",
    "md5_checksum": "b604eb8fb9ccb8ad486906a07d7416bd",
    "minio_url": "https://data.openml.org/datasets/0002/24857/dataset_24857.pq",
    "name": "QSAR-DATASET-FOR-DRUG-TARGET-CHEMBL3904",
    "original_data_url": "https://www.ebi.ac.uk/chembl/target/inspect/CHEMBL3904",
    "parquet_url": "https://data.openml.org/datasets/0002/24857/dataset_24857.pq",
    "processing_date": "2018-10-03 23:02:25",
    "row_id_attribute": "molecule_id",
    "status": "deactivated",
    "tag": [
      "MetaQSAR",
      "study_13"
    ],
    "upload_date": "2016-07-14T15:34:55",
    "url": "https://api.openml.org/data/v1/download/3254966/QSAR-DATASET-FOR-DRUG-TARGET-CHEMBL3904.arff",
    "version": "6",
    "visibility": "public"
  }
}